{"text_format":"1","workbook":"xlsx","n_sheets":12,"sheets":["Mannschaftsspiele","Mannschaftsstatistik_pro_Saison","Mannschaftsstatistik_Gesamt","Einzelergebnisse","Einzelstatistik_pro_Clubkampf","Einzelstatistik_pro_Saison","Einzelstatistik_pro_Mannschaft","Einzelstatistik_Gesamt","Spielprotokoll","Spielerbilanz1","Spielerbilanz2","Tabelle1"],"not_rendered":{"charts":0,"images":0,"macros":1,"external_links":0,"defined_names":73,"comments":0,"pivot_tables":1},"unopened":[],"bounds":{"document_bytes":16777216,"sheet_cells":100000,"rows_first":2000,"rows_last":500,"rows_between":2000,"halvings":0,"cell_chars":16384,"cell_head_chars":4096},"cells_cut":0,"cells_raw":0,"read":"whole","date_system":"1900"}

{"sheet":"Mannschaftsspiele","index":0,"n_rows":30,"n_cols":24,"rows_kept":30,"cut":false,"hidden":false,"merged":[[1,0,1,19]]}
[]
["MANNSCHAFTSERGEBNISSE"]
[]
[{"$f":"(F4+H4)/2","v":21},"SPIELE",null,null,"GESAMT",{"$f":"SUBTOTAL(9,Auswertung1_Mannschaftsspiele)*2+SUBTOTAL(9,Auswertung2_Mannschaftsspiele)","v":20},":",{"$f":"SUBTOTAL(9,Auswertung3_Mannschaftsspiele)*2+SUBTOTAL(9,Auswertung2_Mannschaftsspiele)","v":22},null,null,null,{"$f":"SUBTOTAL(9,L8:L30)","v":289},":",{"$f":"SUBTOTAL(9,N8:N30)","v":383},null,{"$f":"SUBTOTAL(9,P8:P30)","v":1805},":",{"$f":"SUBTOTAL(9,R8:R30)","v":2162},null,{"$f":"SUBTOTAL(9,T8:T30)","v":-357}]
[]
["Platz","lf.-Nr.",null,"Datum",null,"HEIM",null,"GAST","Saison",null,null,null,"Punkte",null,null,null,"Tore",null,null,"Diff."]
[null,21]
[1,1,null,"1973-02-24",null,"SpVgg. Halbau Berlin I","-","Berliner TV 62 I",1973,null,null,26,":",6,null,98,":",65,null,33,null,{"$f":"IF(L8>N8,1,0)","v":1},{"$f":"IF(ISNUMBER(N8),IF(L8=N8,1,0),)","v":0},{"$f":"IF(L8<N8,1,0)","v":0}]
[2,2,null,"1973-03-18",null,"TKV 59 Heslach Stuttgart I","-","TSC Berlin 67 I",1973,null,null,8,":",24,null,88,":",126,null,-38,null,{"$f":"IF(L9>N9,1,0)","v":0},{"$f":"IF(ISNUMBER(N9),IF(L9=N9,1,0),)","v":0},{"$f":"IF(L9<N9,1,0)","v":1}]
[3,3,null,"1973-03-25",null,"Würzburger TKF I","-","Berliner TV 62 I",1973,null,null,8,":",24,null,63,":",119,null,-56,null,{"$f":"IF(L10>N10,1,0)","v":0},{"$f":"IF(ISNUMBER(N10),IF(L10=N10,1,0),)","v":0},{"$f":"IF(L10<N10,1,0)","v":1}]
[4,4,null,"1973-03-25",null,"Berliner TV 62 I","-","TKV 59 Heslach Stuttgart I",1973,null,null,16,":",16,null,87,":",98,null,-11,null,{"$f":"IF(L11>N11,1,0)","v":0},{"$f":"IF(ISNUMBER(N11),IF(L11=N11,1,0),)","v":1},{"$f":"IF(L11<N11,1,0)","v":0}]
[5,5,null,"1973-04-03",null,"TSC Berlin 67 I","-","Berliner TV 62 I",1973,null,null,20,":",12,null,99,":",73,null,26,null,{"$f":"IF(L12>N12,1,0)","v":1},{"$f":"IF(ISNUMBER(N12),IF(L12=N12,1,0),)","v":0},{"$f":"IF(L12<N12,1,0)","v":0}]
[6,6,null,"1973-04-11",null,"SpVgg. Halbau Berlin I","-","TSC Berlin 67 I",1973,null,null,19,":",13,null,84,":",68,null,16,null,{"$f":"IF(L13>N13,1,0)","v":1},{"$f":"IF(ISNUMBER(N13),IF(L13=N13,1,0),)","v":0},{"$f":"IF(L13<N13,1,0)","v":0}]
[7,7,null,"1973-04-14",null,"TKV 59 Heslach Stuttgart I","-","TFG 38 Hildesheim I",1973,null,null,6,":",26,null,74,":",134,null,-60,null,{"$f":"IF(L14>N14,1,0)","v":0},{"$f":"IF(ISNUMBER(N14),IF(L14=N14,1,0),)","v":0},{"$f":"IF(L14<N14,1,0)","v":1}]
[8,8,null,"1973-04-15",null,"Berliner TV 62 I","-","TFC Kickers Hamburg I",1973,null,null,16,":",16,null,109,":",100,null,9,null,{"$f":"IF(L15>N15,1,0)","v":0},{"$f":"IF(ISNUMBER(N15),IF(L15=N15,1,0),)","v":1},{"$f":"IF(L15<N15,1,0)","v":0}]
[9,9,null,"1973-04-15",null,"Würzburger TKF I","-","TFG 38 Hildesheim I",1973,null,null,6,":",26,null,64,":",113,null,-49,null,{"$f":"IF(L16>N16,1,0)","v":0},{"$f":"IF(ISNUMBER(N16),IF(L16=N16,1,0),)","v":0},{"$f":"IF(L16<N16,1,0)","v":1}]
[10,10,null,"1973-04-16",null,"TKV 59 Heslach Stuttgart I","-","Würzburger TKF I",1973,null,null,17,":",15,null,89,":",100,null,-11,null,{"$f":"IF(L17>N17,1,0)","v":1},{"$f":"IF(ISNUMBER(N17),IF(L17=N17,1,0),)","v":0},{"$f":"IF(L17<N17,1,0)","v":0}]
[11,11,null,"1973-04-28",null,"TFC Kickers Hamburg I","-","SpVgg. Halbau Berlin I",1973,null,null,20,":",12,null,71,":",53,null,18,null,{"$f":"IF(L18>N18,1,0)","v":1},{"$f":"IF(ISNUMBER(N18),IF(L18=N18,1,0),)","v":0},{"$f":"IF(L18<N18,1,0)","v":0}]
[12,12,null,"1973-06-02",null,"TKV 59 Heslach Stuttgart I","-","TFC Kickers Hamburg I",1973,null,null,3,":",29,null,88,":",145,null,-57,null,{"$f":"IF(L19>N19,1,0)","v":0},{"$f":"IF(ISNUMBER(N19),IF(L19=N19,1,0),)","v":0},{"$f":"IF(L19<N19,1,0)","v":1}]
[13,13,null,"1973-06-09",null,"SpVgg. Halbau Berlin I","-","TKV 59 Heslach Stuttgart I",1973,null,null,23,":",9,null,92,":",66,null,26,null,{"$f":"IF(L20>N20,1,0)","v":1},{"$f":"IF(ISNUMBER(N20),IF(L20=N20,1,0),)","v":0},{"$f":"IF(L20<N20,1,0)","v":0}]
[14,14,null,"1973-06-09",null,"Würzburger TKF I","-","TFC Kickers Hamburg I",1973,null,null,5,":",27,null,89,":",168,null,-79,null,{"$f":"IF(L21>N21,1,0)","v":0},{"$f":"IF(ISNUMBER(N21),IF(L21=N21,1,0),)","v":0},{"$f":"IF(L21<N21,1,0)","v":1}]
[15,15,null,"1973-06-10",null,"TFC Kickers Hamburg I","-","TSC Berlin 67 I",1973,null,null,23,":",9,null,114,":",89,null,25,null,{"$f":"IF(L22>N22,1,0)","v":1},{"$f":"IF(ISNUMBER(N22),IF(L22=N22,1,0),)","v":0},{"$f":"IF(L22<N22,1,0)","v":0}]
[16,16,null,"1973-06-10",null,"Würzburger TKF I","-","TSC Berlin 67 I",1973,null,null,5,":",27,null,66,":",140,null,-74,null,{"$f":"IF(L23>N23,1,0)","v":0},{"$f":"IF(ISNUMBER(N23),IF(L23=N23,1,0),)","v":0},{"$f":"IF(L23<N23,1,0)","v":1}]
[17,17,null,"1973-06-10",null,"TFG 38 Hildesheim I","-","SpVgg. Halbau Berlin I",1973,null,null,18,":",14,null,79,":",67,null,12,null,{"$f":"IF(L24>N24,1,0)","v":1},{"$f":"IF(ISNUMBER(N24),IF(L24=N24,1,0),)","v":0},{"$f":"IF(L24<N24,1,0)","v":0}]
[18,18,null,"1973-06-10",null,"Würzburger TKF I","-","SpVgg. Halbau Berlin I",1973,null,null,6,":",26,null,84,":",127,null,-43,null,{"$f":"IF(L25>N25,1,0)","v":0},{"$f":"IF(ISNUMBER(N25),IF(L25=N25,1,0),)","v":0},{"$f":"IF(L25<N25,1,0)","v":1}]
[19,19,null,"1973-06-16",null,"TSC Berlin 67 I","-","TFG 38 Hildesheim I",1973,null,null,13,":",19,null,73,":",101,null,-28,null,{"$f":"IF(L26>N26,1,0)","v":0},{"$f":"IF(ISNUMBER(N26),IF(L26=N26,1,0),)","v":0},{"$f":"IF(L26<N26,1,0)","v":1}]
[20,20,null,"1973-06-17",null,"Berliner TV 62 I","-","TFG 38 Hildesheim I",1973,null,null,7,":",25,null,71,":",138,null,-67,null,{"$f":"IF(L27>N27,1,0)","v":0},{"$f":"IF(ISNUMBER(N27),IF(L27=N27,1,0),)","v":0},{"$f":"IF(L27<N27,1,0)","v":1}]
[21,21,null,"1973-08-19",null,"TFG 38 Hildesheim I","-","TFC Kickers Hamburg I",1973,null,null,24,":",8,null,123,":",72,null,51,null,{"$f":"IF(L28>N28,1,0)","v":1},{"$f":"IF(ISNUMBER(N28),IF(L28=N28,1,0),)","v":0},{"$f":"IF(L28<N28,1,0)","v":0}]
[null,null,null,null,null,null,null,null,null,null,null,null,null,null,null,null,null,null,null,null,null,{"$f":"IF(L29>N29,1,0)","v":0},{"$f":"IF(ISNUMBER(N29),IF(L29=N29,1,0),)","v":0},{"$f":"IF(L29<N29,1,0)","v":0}]
[2,null,null,null,null,null,null,null,null,null,null,null,null,null,null,null,null,null,null,null,null,{"$f":"IF(L30>N30,1,0)","v":0},{"$f":"IF(ISNUMBER(N30),IF(L30=N30,1,0),)","v":0},{"$f":"IF(L30<N30,1,0)","v":0}]

{"sheet":"Mannschaftsstatistik_pro_Saison","index":1,"n_rows":14,"n_cols":30,"rows_kept":14,"cut":false,"hidden":false,"merged":[[3,23,3,29],[1,0,1,29]]}
[]
["MANNSCHAFTSSTATISTIK PRO SAISON"]
[]
[null,"GESAMT",null,{"$f":"SUBTOTAL(9,D8:D20)","v":42},null,{"$f":"SUBTOTAL(9,F8:F20)","v":19},{"$f":"SUBTOTAL(9,G8:G20)","v":4},{"$f":"SUBTOTAL(9,H8:H20)","v":19},null,{"$f":"SUBTOTAL(9,J8:J20)","v":42},":",{"$f":"SUBTOTAL(9,L8:L20)","v":42},null,{"$f":"SUBTOTAL(9,N8:N20)","v":672},":",{"$f":"SUBTOTAL(9,P8:P20)","v":672},null,{"$f":"SUBTOTAL(9,R8:R20)","v":3967},":",{"$f":"SUBTOTAL(9,T8:T20)","v":3967},null,{"$f":"SUBTOTAL(9,V8:V20)","v":0},null,"Durchschnitt"]
[]
["Platz","Mannschaft","Saison","Spiele",null,"S","U","N",null,null,"Punkte",null,null,null,"Spielpunkte",null,null,null,"Tore",null,null,"Diff.",null,"Punkte",null,"Spielpunkte",null,null,"Tore"]
[null,7,null,null,null,null,null,null,null,null,null,null,null,null,null,null,null,null,null,null,null,null,null,null,null,null,null,null,":"]
[1,"TFG 38 Hildesheim I",1973,6,null,6,0,0,null,12,":",0,null,138,":",54,null,688,":",421,null,267,null,2,null,23,null,114.66666666666667,":",70.166666666666671]
[2,"TFC Kickers Hamburg I",1973,6,null,4,1,1,null,9,":",3,null,123,":",69,null,670,":",551,null,119,null,1.5,null,20.5,null,111.66666666666667,":",91.833333333333329]
[3,"SpVgg. Halbau Berlin I",1973,6,null,4,0,2,null,8,":",4,null,120,":",72,null,521,":",433,null,88,null,1.3333333333333333,null,20,null,86.833333333333329,":",72.166666666666671]
[4,"TSC Berlin 67 I",1973,6,null,3,0,3,null,6,":",6,null,106,":",86,null,595,":",526,null,69,null,1,null,17.666666666666668,null,99.166666666666671,":",87.666666666666671]
[5,"Berliner TV 62 I",1973,6,null,1,2,3,null,4,":",8,null,81,":",111,null,524,":",596,null,-72,null,0.66666666666666663,null,13.5,null,87.333333333333329,":",99.333333333333329]
[6,"TKV 59 Heslach Stuttgart I",1973,6,null,1,1,4,null,3,":",9,null,59,":",133,null,503,":",684,null,-181,null,0.5,null,9.8333333333333339,null,83.833333333333329,":",114]
[7,"Würzburger TKF I",1973,6,null,0,0,6,null,0,":",12,null,45,":",147,null,466,":",756,null,-290,null,0,null,7.5,null,77.666666666666671,":",126]

{"sheet":"Mannschaftsstatistik_Gesamt","index":2,"n_rows":14,"n_cols":30,"rows_kept":14,"cut":false,"hidden":false,"merged":[[3,23,3,29],[1,0,1,29]]}
[]
["MANNSCHAFTSSTATISTIK GESAMT"]
[]
[null,"GESAMT",null,{"$f":"SUM(D8:D16)","v":42},null,{"$f":"SUM(F8:F16)","v":19},{"$f":"SUM(G8:G16)","v":4},{"$f":"SUM(H8:H16)","v":19},null,{"$f":"SUBTOTAL(9,J8:J16)","v":42},":",{"$f":"SUBTOTAL(9,L8:L16)","v":42},null,{"$f":"SUBTOTAL(9,N8:N16)","v":672},":",{"$f":"SUBTOTAL(9,P8:P16)","v":672},null,{"$f":"SUBTOTAL(9,R8:R16)","v":3967},":",{"$f":"SUBTOTAL(9,T8:T16)","v":3967},null,{"$f":"SUBTOTAL(9,V8:V16)","v":0},null,"Durchschnitt"]
[]
["Platz","Mannschaft","Saisons","Spiele",null,"S","U","N",null,null,"Punkte",null,null,null,"Spielpunkte",null,null,null,"Tore",null,null,"Diff.",null,"Punkte",null,"Spielpunkte",null,null,"Tore"]
[null,7]
[1,"TFG 38 Hildesheim I",1,6,null,6,0,0,null,12,":",0,null,138,":",54,null,688,":",421,null,267,null,2,null,23,null,114.66666666666667,":",70.166666666666671]
[2,"TFC Kickers Hamburg I",1,6,null,4,1,1,null,9,":",3,null,123,":",69,null,670,":",551,null,119,null,1.5,null,20.5,null,111.66666666666667,":",91.833333333333329]
[3,"SpVgg. Halbau Berlin I",1,6,null,4,0,2,null,8,":",4,null,120,":",72,null,521,":",433,null,88,null,1.3333333333333333,null,20,null,86.833333333333329,":",72.166666666666671]
[4,"TSC Berlin 67 I",1,6,null,3,0,3,null,6,":",6,null,106,":",86,null,595,":",526,null,69,null,1,null,17.666666666666668,null,99.166666666666671,":",87.666666666666671]
[5,"Berliner TV 62 I",1,6,null,1,2,3,null,4,":",8,null,81,":",111,null,524,":",596,null,-72,null,0.66666666666666663,null,13.5,null,87.333333333333329,":",99.333333333333329]
[6,"TKV 59 Heslach Stuttgart I",1,6,null,1,1,4,null,3,":",9,null,59,":",133,null,503,":",684,null,-181,null,0.5,null,9.8333333333333339,null,83.833333333333329,":",114]
[7,"Würzburger TKF I",1,6,null,0,0,6,null,0,":",12,null,45,":",147,null,466,":",756,null,-290,null,0,null,7.5,null,77.666666666666671,":",126]

{"sheet":"Einzelergebnisse","index":3,"n_rows":345,"n_cols":21,"rows_kept":345,"cut":false,"hidden":false,"merged":[[1,0,1,16]]}
[]
["EINZELERGEBNISSE"]
[]
[null,null,null,null,null,null,"GESAMT",null,null,null,{"$f":"SUBTOTAL(9,Auswertung1_Einzelergebnisse)*2+SUBTOTAL(9,Auswertung2_Einzelergebnisse)","v":289},":",{"$f":"SUBTOTAL(9,Auswertung3_Einzelergebnisse)*2+SUBTOTAL(9,Auswertung2_Einzelergebnisse)","v":383},null,{"$f":"SUBTOTAL(9,O8:O345)","v":1805},":",{"$f":"SUBTOTAL(9,Q8:Q345)","v":2162}]
[]
["Platz","lf.-Nr.","Pos.","Datum","HEIM",null,"GAST",null,"Saison",null,null,null,null,null,null,"Tore"]
[]
[1,1,1,"1973-02-24","SpVgg. Halbau Berlin I","-","Berliner TV 62 I",null,1973,null,"DIEKERT, Wolfram","-","LEOPOLD, Wolfgang",null,5,":",7,null,{"$f":"IF(O8>Q8,1,0)","v":0},{"$f":"IF(ISNUMBER(Q8),IF(O8=Q8,1,0),0)","v":0},{"$f":"IF(O8<Q8,1,0)","v":1}]
[2,1,2,"1973-02-24","SpVgg. Halbau Berlin I","-","Berliner TV 62 I",null,1973,null,"SUCHAN, Rainer","-","MIETKE, Wilfried",null,6,":",2,null,{"$f":"IF(O9>Q9,1,0)","v":1},{"$f":"IF(ISNUMBER(Q9),IF(O9=Q9,1,0),0)","v":0},{"$f":"IF(O9<Q9,1,0)","v":0}]
[3,1,3,"1973-02-24","SpVgg. Halbau Berlin I","-","Berliner TV 62 I",null,1973,null,"KOLSKI, Wolfgang","-","MIETKE, Reinhard",null,5,":",4,null,1,0,0]
[4,1,4,"1973-02-24","SpVgg. Halbau Berlin I","-","Berliner TV 62 I",null,1973,null,"RÖPKE, Jürgen","-","KLEINSCHMIDT, Gerd",null,6,":",5,null,1,0,0]
[5,1,5,"1973-02-24","SpVgg. Halbau Berlin I","-","Berliner TV 62 I",null,1973,null,"SUCHAN, Rainer","-","LEOPOLD, Wolfgang",null,6,":",4,null,1,0,0]
[6,1,6,"1973-02-24","SpVgg. Halbau Berlin I","-","Berliner TV 62 I",null,1973,null,"KOLSKI, Wolfgang","-","MIETKE, Wilfried",null,3,":",5,null,0,0,1]
[7,1,7,"1973-02-24","SpVgg. Halbau Berlin I","-","Berliner TV 62 I",null,1973,null,"RÖPKE, Jürgen","-","MIETKE, Reinhard",null,5,":",4,null,1,0,0]
[8,1,8,"1973-02-24","SpVgg. Halbau Berlin I","-","Berliner TV 62 I",null,1973,null,"DIEKERT, Wolfram","-","KLEINSCHMIDT, Gerd",null,9,":",5,null,1,0,0]
[9,1,9,"1973-02-24","SpVgg. Halbau Berlin I","-","Berliner TV 62 I",null,1973,null,"RÖPKE, Jürgen","-","MIETKE, Wilfried",null,8,":",2,null,1,0,0]
[10,1,10,"1973-02-24","SpVgg. Halbau Berlin I","-","Berliner TV 62 I",null,1973,null,"KOLSKI, Wolfgang","-","LEOPOLD, Wolfgang",null,8,":",3,null,1,0,0]
[11,1,11,"1973-02-24","SpVgg. Halbau Berlin I","-","Berliner TV 62 I",null,1973,null,"SUCHAN, Rainer","-","KLEINSCHMIDT, Gerd",null,13,":",4,null,1,0,0]
[12,1,12,"1973-02-24","SpVgg. Halbau Berlin I","-","Berliner TV 62 I",null,1973,null,"DIEKERT, Wolfram","-","MIETKE, Reinhard",null,3,":",2,null,1,0,0]
[13,1,13,"1973-02-24","SpVgg. Halbau Berlin I","-","Berliner TV 62 I",null,1973,null,"DIEKERT, Wolfram","-","MIETKE, Wilfried",null,5,":",10,null,0,0,1]
[14,1,14,"1973-02-24","SpVgg. Halbau Berlin I","-","Berliner TV 62 I",null,1973,null,"RÖPKE, Jürgen","-","LEOPOLD, Wolfgang",null,6,":",3,null,1,0,0]
[15,1,15,"1973-02-24","SpVgg. Halbau Berlin I","-","Berliner TV 62 I",null,1973,null,"KOLSKI, Wolfgang","-","KLEINSCHMIDT, Gerd",null,5,":",4,null,1,0,0]
[16,1,16,"1973-02-24","SpVgg. Halbau Berlin I","-","Berliner TV 62 I",null,1973,null,"SUCHAN, Rainer","-","MIETKE, Reinhard",null,5,":",1,null,1,0,0]
[17,2,1,"1973-03-18","TKV 59 Heslach Stuttgart I","-","TSC Berlin 67 I",null,1973,null,"PFETSCH, Jochem","-","GRÜNEBERG, Manfred",null,9,":",5,null,1,0,0]
[18,2,2,"1973-03-18","TKV 59 Heslach Stuttgart I","-","TSC Berlin 67 I",null,1973,null,"SCHMIßRAUTER, Manfred","-","GRÜNEBERG, Klaus-Dieter",null,0,":",7,null,{"$f":"IF(O25>Q25,1,0)","v":0},{"$f":"IF(ISNUMBER(Q25),IF(O25=Q25,1,0),0)","v":0},{"$f":"IF(O25<Q25,1,0)","v":1}]
[19,2,3,"1973-03-18","TKV 59 Heslach Stuttgart I","-","TSC Berlin 67 I",null,1973,null,"WAHL, Günther","-","SCHÖNFELD, Horst",null,5,":",10,null,0,0,1]
[20,2,4,"1973-03-18","TKV 59 Heslach Stuttgart I","-","TSC Berlin 67 I",null,1973,null,"WÖHR, Hans-Joachim","-","JAKOB, Jörg",null,8,":",7,null,1,0,0]
[21,2,5,"1973-03-18","TKV 59 Heslach Stuttgart I","-","TSC Berlin 67 I",null,1973,null,"SCHMIßRAUTER, Manfred","-","GRÜNEBERG, Manfred",null,5,":",6,null,0,0,1]
[22,2,6,"1973-03-18","TKV 59 Heslach Stuttgart I","-","TSC Berlin 67 I",null,1973,null,"WAHL, Günther","-","GRÜNEBERG, Klaus-Dieter",null,4,":",9,null,0,0,1]
[23,2,7,"1973-03-18","TKV 59 Heslach Stuttgart I","-","TSC Berlin 67 I",null,1973,null,"WÖHR, Hans-Joachim","-","SCHÖNFELD, Horst",null,4,":",8,null,0,0,1]
[24,2,8,"1973-03-18","TKV 59 Heslach Stuttgart I","-","TSC Berlin 67 I",null,1973,null,"PFETSCH, Jochem","-","JAKOB, Jörg",null,5,":",7,null,0,0,1]
[25,2,9,"1973-03-18","TKV 59 Heslach Stuttgart I","-","TSC Berlin 67 I",null,1973,null,"WÖHR, Hans-Joachim","-","GRÜNEBERG, Klaus-Dieter",null,5,":",12,null,0,0,1]
[26,2,10,"1973-03-18","TKV 59 Heslach Stuttgart I","-","TSC Berlin 67 I",null,1973,null,"WAHL, Günther","-","GRÜNEBERG, Manfred",null,5,":",10,null,0,0,1]
[27,2,11,"1973-03-18","TKV 59 Heslach Stuttgart I","-","TSC Berlin 67 I",null,1973,null,"SCHMIßRAUTER, Manfred","-","JAKOB, Jörg",null,3,":",5,null,0,0,1]
[28,2,12,"1973-03-18","TKV 59 Heslach Stuttgart I","-","TSC Berlin 67 I",null,1973,null,"PFETSCH, Jochem","-","SCHÖNFELD, Horst",null,4,":",10,null,0,0,1]
[29,2,13,"1973-03-18","TKV 59 Heslach Stuttgart I","-","TSC Berlin 67 I",null,1973,null,"PFETSCH, Jochem","-","GRÜNEBERG, Klaus-Dieter",null,16,":",10,null,1,0,0]
[30,2,14,"1973-03-18","TKV 59 Heslach Stuttgart I","-","TSC Berlin 67 I",null,1973,null,"WÖHR, Hans-Joachim","-","GRÜNEBERG, Manfred",null,4,":",8,null,0,0,1]
[31,2,15,"1973-03-18","TKV 59 Heslach Stuttgart I","-","TSC Berlin 67 I",null,1973,null,"WAHL, Günther","-","JAKOB, Jörg",null,5,":",4,null,1,0,0]
[32,2,16,"1973-03-18","TKV 59 Heslach Stuttgart I","-","TSC Berlin 67 I",null,1973,null,"SCHMIßRAUTER, Manfred","-","SCHÖNFELD, Horst",null,6,":",8,null,0,0,1]
[33,3,1,"1973-03-25","Würzburger TKF I","-","Berliner TV 62 I",null,1973,null,"NÖRLING, Karl","-","MIETKE, Wilfried",null,0,":",13,null,0,0,1]
[34,3,2,"1973-03-25","Würzburger TKF I","-","Berliner TV 62 I",null,1973,null,"PFEIFFENBERGER, Wolfgang","-","KLEINSCHMIDT, Gerd",null,7,":",10,null,{"$f":"IF(O41>Q41,1,0)","v":0},{"$f":"IF(ISNUMBER(Q41),IF(O41=Q41,1,0),0)","v":0},{"$f":"IF(O41<Q41,1,0)","v":1}]
[35,3,3,"1973-03-25","Würzburger TKF I","-","Berliner TV 62 I",null,1973,null,"REUL, Winfried","-","GRIMM, Walter",null,8,":",5,null,1,0,0]
[36,3,4,"1973-03-25","Würzburger TKF I","-","Berliner TV 62 I",null,1973,null,"BEMERL, Bernd","-","LEOPOLD, Wolfgang",null,3,":",4,null,0,0,1]
[37,3,5,"1973-03-25","Würzburger TKF I","-","Berliner TV 62 I",null,1973,null,"PFEIFFENBERGER, Wolfgang","-","MIETKE, Wilfried",null,2,":",12,null,0,0,1]
[38,3,6,"1973-03-25","Würzburger TKF I","-","Berliner TV 62 I",null,1973,null,"REUL, Winfried","-","KLEINSCHMIDT, Gerd",null,1,":",5,null,0,0,1]
[39,3,7,"1973-03-25","Würzburger TKF I","-","Berliner TV 62 I",null,1973,null,"BEMERL, Bernd","-","GRIMM, Walter",null,7,":",2,null,1,0,0]
[40,3,8,"1973-03-25","Würzburger TKF I","-","Berliner TV 62 I",null,1973,null,"NÖRLING, Karl","-","LEOPOLD, Wolfgang",null,4,":",10,null,0,0,1]
[41,3,9,"1973-03-25","Würzburger TKF I","-","Berliner TV 62 I",null,1973,null,"BEMERL, Bernd","-","KLEINSCHMIDT, Gerd",null,2,":",9,null,0,0,1]
[42,3,10,"1973-03-25","Würzburger TKF I","-","Berliner TV 62 I",null,1973,null,"REUL, Winfried","-","MIETKE, Wilfried",null,4,":",6,null,0,0,1]
[43,3,11,"1973-03-25","Würzburger TKF I","-","Berliner TV 62 I",null,1973,null,"PFEIFFENBERGER, Wolfgang","-","LEOPOLD, Wolfgang",null,2,":",12,null,0,0,1]
[44,3,12,"1973-03-25","Würzburger TKF I","-","Berliner TV 62 I",null,1973,null,"NÖRLING, Karl","-","GRIMM, Walter",null,5,":",3,null,1,0,0]
[45,3,13,"1973-03-25","Würzburger TKF I","-","Berliner TV 62 I",null,1973,null,"NÖRLING, Karl","-","KLEINSCHMIDT, Gerd",null,7,":",6,null,1,0,0]
[46,3,14,"1973-03-25","Würzburger TKF I","-","Berliner TV 62 I",null,1973,null,"BEMERL, Bernd","-","MIETKE, Wilfried",null,4,":",7,null,0,0,1]
[47,3,15,"1973-03-25","Würzburger TKF I","-","Berliner TV 62 I",null,1973,null,"REUL, Winfried","-","LEOPOLD, Wolfgang",null,2,":",9,null,0,0,1]
[48,3,16,"1973-03-25","Würzburger TKF I","-","Berliner TV 62 I",null,1973,null,"PFEIFFENBERGER, Wolfgang","-","GRIMM, Walter",null,5,":",6,null,0,0,1]
[49,4,1,"1973-03-25","Berliner TV 62 I","-","TKV 59 Heslach Stuttgart I",null,1973,null,"MIETKE, Wilfried","-","WÖHR, Hans-Joachim",null,4,":",4,null,0,1,0]
[50,4,2,"1973-03-25","Berliner TV 62 I","-","TKV 59 Heslach Stuttgart I",null,1973,null,"LEOPOLD, Wolfgang","-","PFETSCH, Jochem",null,3,":",2,null,{"$f":"IF(O57>Q57,1,0)","v":1},{"$f":"IF(ISNUMBER(Q57),IF(O57=Q57,1,0),0)","v":0},{"$f":"IF(O57<Q57,1,0)","v":0}]
[51,4,3,"1973-03-25","Berliner TV 62 I","-","TKV 59 Heslach Stuttgart I",null,1973,null,"GRIMM, Walter","-","BECHT, Peter",null,3,":",2,null,1,0,0]
[52,4,4,"1973-03-25","Berliner TV 62 I","-","TKV 59 Heslach Stuttgart I",null,1973,null,"KLEINSCHMIDT, Gerd","-","SCHMIßRAUTER, Manfred",null,7,":",10,null,0,0,1]
[53,4,5,"1973-03-25","Berliner TV 62 I","-","TKV 59 Heslach Stuttgart I",null,1973,null,"LEOPOLD, Wolfgang","-","WÖHR, Hans-Joachim",null,4,":",9,null,0,0,1]
[54,4,6,"1973-03-25","Berliner TV 62 I","-","TKV 59 Heslach Stuttgart I",null,1973,null,"GRIMM, Walter","-","PFETSCH, Jochem",null,10,":",5,null,1,0,0]
[55,4,7,"1973-03-25","Berliner TV 62 I","-","TKV 59 Heslach Stuttgart I",null,1973,null,"KLEINSCHMIDT, Gerd","-","BECHT, Peter",null,6,":",4,null,1,0,0]
[56,4,8,"1973-03-25","Berliner TV 62 I","-","TKV 59 Heslach Stuttgart I",null,1973,null,"MIETKE, Wilfried","-","SCHMIßRAUTER, Manfred",null,3,":",7,null,0,0,1]
[57,4,9,"1973-03-25","Berliner TV 62 I","-","TKV 59 Heslach Stuttgart I",null,1973,null,"KLEINSCHMIDT, Gerd","-","PFETSCH, Jochem",null,7,":",7,null,0,1,0]
[58,4,10,"1973-03-25","Berliner TV 62 I","-","TKV 59 Heslach Stuttgart I",null,1973,null,"GRIMM, Walter","-","WÖHR, Hans-Joachim",null,5,":",10,null,0,0,1]
[59,4,11,"1973-03-25","Berliner TV 62 I","-","TKV 59 Heslach Stuttgart I",null,1973,null,"LEOPOLD, Wolfgang","-","SCHMIßRAUTER, Manfred",null,9,":",7,null,1,0,0]
[60,4,12,"1973-03-25","Berliner TV 62 I","-","TKV 59 Heslach Stuttgart I",null,1973,null,"MIETKE, Wilfried","-","BECHT, Peter",null,3,":",5,null,0,0,1]
[61,4,13,"1973-03-25","Berliner TV 62 I","-","TKV 59 Heslach Stuttgart I",null,1973,null,"MIETKE, Wilfried","-","PFETSCH, Jochem",null,10,":",6,null,1,0,0]
[62,4,14,"1973-03-25","Berliner TV 62 I","-","TKV 59 Heslach Stuttgart I",null,1973,null,"KLEINSCHMIDT, Gerd","-","WÖHR, Hans-Joachim",null,5,":",7,null,0,0,1]
[63,4,15,"1973-03-25","Berliner TV 62 I","-","TKV 59 Heslach Stuttgart I",null,1973,null,"GRIMM, Walter","-","SCHMIßRAUTER, Manfred",null,5,":",11,null,0,0,1]
[64,4,16,"1973-03-25","Berliner TV 62 I","-","TKV 59 Heslach Stuttgart I",null,1973,null,"LEOPOLD, Wolfgang","-","BECHT, Peter",null,3,":",2,null,1,0,0]
[65,5,1,"1973-04-03","TSC Berlin 67 I","-","Berliner TV 62 I",null,1973,null,"SCHÖNFELD, Horst","-","KWELLA, Frank",null,4,":",3,null,1,0,0]
[66,5,2,"1973-04-03","TSC Berlin 67 I","-","Berliner TV 62 I",null,1973,null,"GRÜNEBERG, Klaus-Dieter","-","KLEINSCHMIDT, Gerd",null,2,":",4,null,{"$f":"IF(O73>Q73,1,0)","v":0},{"$f":"IF(ISNUMBER(Q73),IF(O73=Q73,1,0),0)","v":0},{"$f":"IF(O73<Q73,1,0)","v":1}]
[67,5,3,"1973-04-03","TSC Berlin 67 I","-","Berliner TV 62 I",null,1973,null,"GRÜNEBERG, Manfred","-","MIETKE, Wilfried",null,2,":",6,null,0,0,1]
[68,5,4,"1973-04-03","TSC Berlin 67 I","-","Berliner TV 62 I",null,1973,null,"MELISS, Dieter","-","MIETKE, Reinhard",null,7,":",5,null,1,0,0]
[69,5,5,"1973-04-03","TSC Berlin 67 I","-","Berliner TV 62 I",null,1973,null,"GRÜNEBERG, Klaus-Dieter","-","KWELLA, Frank",null,10,":",2,null,1,0,0]
[70,5,6,"1973-04-03","TSC Berlin 67 I","-","Berliner TV 62 I",null,1973,null,"GRÜNEBERG, Manfred","-","KLEINSCHMIDT, Gerd",null,8,":",9,null,0,0,1]
[71,5,7,"1973-04-03","TSC Berlin 67 I","-","Berliner TV 62 I",null,1973,null,"MELISS, Dieter","-","MIETKE, Wilfried",null,2,":",10,null,0,0,1]
[72,5,8,"1973-04-03","TSC Berlin 67 I","-","Berliner TV 62 I",null,1973,null,"SCHÖNFELD, Horst","-","MIETKE, Reinhard",null,7,":",2,null,1,0,0]
[73,5,9,"1973-04-03","TSC Berlin 67 I","-","Berliner TV 62 I",null,1973,null,"MELISS, Dieter","-","KLEINSCHMIDT, Gerd",null,8,":",7,null,1,0,0]
[74,5,10,"1973-04-03","TSC Berlin 67 I","-","Berliner TV 62 I",null,1973,null,"GRÜNEBERG, Manfred","-","KWELLA, Frank",null,9,":",1,null,1,0,0]
[75,5,11,"1973-04-03","TSC Berlin 67 I","-","Berliner TV 62 I",null,1973,null,"GRÜNEBERG, Klaus-Dieter","-","MIETKE, Reinhard",null,7,":",5,null,1,0,0]
[76,5,12,"1973-04-03","TSC Berlin 67 I","-","Berliner TV 62 I",null,1973,null,"SCHÖNFELD, Horst","-","MIETKE, Wilfried",null,3,":",5,null,0,0,1]
[77,5,13,"1973-04-03","TSC Berlin 67 I","-","Berliner TV 62 I",null,1973,null,"SCHÖNFELD, Horst","-","KLEINSCHMIDT, Gerd",null,10,":",5,null,1,0,0]
[78,5,14,"1973-04-03","TSC Berlin 67 I","-","Berliner TV 62 I",null,1973,null,"MELISS, Dieter","-","KWELLA, Frank",null,10,":",4,null,1,0,0]
[79,5,15,"1973-04-03","TSC Berlin 67 I","-","Berliner TV 62 I",null,1973,null,"GRÜNEBERG, Manfred","-","MIETKE, Reinhard",null,6,":",0,null,1,0,0]
[80,5,16,"1973-04-03","TSC Berlin 67 I","-","Berliner TV 62 I",null,1973,null,"GRÜNEBERG, Klaus-Dieter","-","MIETKE, Wilfried",null,4,":",5,null,0,0,1]
[81,6,1,"1973-04-11","SpVgg. Halbau Berlin I","-","TSC Berlin 67 I",null,1973,null,"RÖPKE, Jürgen","-","GRÜNEBERG, Klaus-Dieter",null,4,":",5,null,0,0,1]
[82,6,2,"1973-04-11","SpVgg. Halbau Berlin I","-","TSC Berlin 67 I",null,1973,null,"KOLSKI, Wolfgang","-","GRÜNEBERG, Manfred",null,3,":",7,null,{"$f":"IF(O89>Q89,1,0)","v":0},{"$f":"IF(ISNUMBER(Q89),IF(O89=Q89,1,0),0)","v":0},{"$f":"IF(O89<Q89,1,0)","v":1}]
[83,6,3,"1973-04-11","SpVgg. Halbau Berlin I","-","TSC Berlin 67 I",null,1973,null,"SUCHAN, Rainer","-","GUTTMANN, Peter",null,7,":",4,null,1,0,0]
[84,6,4,"1973-04-11","SpVgg. Halbau Berlin I","-","TSC Berlin 67 I",null,1973,null,"DIEKERT, Wolfram","-","MELISS, Dieter",null,8,":",7,null,1,0,0]
[85,6,5,"1973-04-11","SpVgg. Halbau Berlin I","-","TSC Berlin 67 I",null,1973,null,"KOLSKI, Wolfgang","-","GRÜNEBERG, Klaus-Dieter",null,5,":",5,null,0,1,0]
[86,6,6,"1973-04-11","SpVgg. Halbau Berlin I","-","TSC Berlin 67 I",null,1973,null,"SUCHAN, Rainer","-","GRÜNEBERG, Manfred",null,2,":",3,null,0,0,1]
[87,6,7,"1973-04-11","SpVgg. Halbau Berlin I","-","TSC Berlin 67 I",null,1973,null,"DIEKERT, Wolfram","-","GUTTMANN, Peter",null,4,":",1,null,1,0,0]
[88,6,8,"1973-04-11","SpVgg. Halbau Berlin I","-","TSC Berlin 67 I",null,1973,null,"RÖPKE, Jürgen","-","MELISS, Dieter",null,10,":",4,null,1,0,0]
[89,6,9,"1973-04-11","SpVgg. Halbau Berlin I","-","TSC Berlin 67 I",null,1973,null,"DIEKERT, Wolfram","-","GRÜNEBERG, Manfred",null,5,":",4,null,1,0,0]
[90,6,10,"1973-04-11","SpVgg. Halbau Berlin I","-","TSC Berlin 67 I",null,1973,null,"SUCHAN, Rainer","-","GRÜNEBERG, Klaus-Dieter",null,3,":",3,null,0,1,0]
[91,6,11,"1973-04-11","SpVgg. Halbau Berlin I","-","TSC Berlin 67 I",null,1973,null,"KOLSKI, Wolfgang","-","MELISS, Dieter",null,9,":",2,null,1,0,0]
[92,6,12,"1973-04-11","SpVgg. Halbau Berlin I","-","TSC Berlin 67 I",null,1973,null,"RÖPKE, Jürgen","-","GUTTMANN, Peter",null,8,":",2,null,1,0,0]
[93,6,13,"1973-04-11","SpVgg. Halbau Berlin I","-","TSC Berlin 67 I",null,1973,null,"RÖPKE, Jürgen","-","GRÜNEBERG, Manfred",null,2,":",7,null,0,0,1]
[94,6,14,"1973-04-11","SpVgg. Halbau Berlin I","-","TSC Berlin 67 I",null,1973,null,"DIEKERT, Wolfram","-","GRÜNEBERG, Klaus-Dieter",null,3,":",3,null,0,1,0]
[95,6,15,"1973-04-11","SpVgg. Halbau Berlin I","-","TSC Berlin 67 I",null,1973,null,"SUCHAN, Rainer","-","MELISS, Dieter",null,7,":",8,null,0,0,1]
[96,6,16,"1973-04-11","SpVgg. Halbau Berlin I","-","TSC Berlin 67 I",null,1973,null,"KOLSKI, Wolfgang","-","GUTTMANN, Peter",null,4,":",3,null,1,0,0]
[97,7,1,"1973-04-14","TKV 59 Heslach Stuttgart I","-","TFG 38 Hildesheim I",null,1973,null,"BECHT, Peter","-","WEDEKIN, Franz",null,5,":",7,null,0,0,1]
[98,7,2,"1973-04-14","TKV 59 Heslach Stuttgart I","-","TFG 38 Hildesheim I",null,1973,null,"PFETSCH, Jochem","-","FINK, Michael",null,5,":",8,null,{"$f":"IF(O105>Q105,1,0)","v":0},{"$f":"IF(ISNUMBER(Q105),IF(O105=Q105,1,0),0)","v":0},{"$f":"IF(O105<Q105,1,0)","v":1}]
[99,7,3,"1973-04-14","TKV 59 Heslach Stuttgart I","-","TFG 38 Hildesheim I",null,1973,null,"SCHMIßRAUTER, Manfred","-","MINNICH, Michael",null,6,":",9,null,0,0,1]
[100,7,4,"1973-04-14","TKV 59 Heslach Stuttgart I","-","TFG 38 Hildesheim I",null,1973,null,"WÖHR, Hans-Joachim","-","KOCH, Hans-Joachim",null,5,":",11,null,0,0,1]
[101,7,5,"1973-04-14","TKV 59 Heslach Stuttgart I","-","TFG 38 Hildesheim I",null,1973,null,"PFETSCH, Jochem","-","WEDEKIN, Franz",null,2,":",11,null,0,0,1]
[102,7,6,"1973-04-14","TKV 59 Heslach Stuttgart I","-","TFG 38 Hildesheim I",null,1973,null,"SCHMIßRAUTER, Manfred","-","FINK, Michael",null,5,":",6,null,0,0,1]
[103,7,7,"1973-04-14","TKV 59 Heslach Stuttgart I","-","TFG 38 Hildesheim I",null,1973,null,"WÖHR, Hans-Joachim","-","MINNICH, Michael",null,4,":",11,null,0,0,1]
[104,7,8,"1973-04-14","TKV 59 Heslach Stuttgart I","-","TFG 38 Hildesheim I",null,1973,null,"BECHT, Peter","-","KOCH, Hans-Joachim",null,4,":",12,null,0,0,1]
[105,7,9,"1973-04-14","TKV 59 Heslach Stuttgart I","-","TFG 38 Hildesheim I",null,1973,null,"WÖHR, Hans-Joachim","-","FINK, Michael",null,7,":",9,null,0,0,1]
[106,7,10,"1973-04-14","TKV 59 Heslach Stuttgart I","-","TFG 38 Hildesheim I",null,1973,null,"SCHMIßRAUTER, Manfred","-","WEDEKIN, Franz",null,3,":",9,null,0,0,1]
[107,7,11,"1973-04-14","TKV 59 Heslach Stuttgart I","-","TFG 38 Hildesheim I",null,1973,null,"PFETSCH, Jochem","-","KOCH, Hans-Joachim",null,4,":",9,null,0,0,1]
[108,7,12,"1973-04-14","TKV 59 Heslach Stuttgart I","-","TFG 38 Hildesheim I",null,1973,null,"BECHT, Peter","-","MINNICH, Michael",null,5,":",10,null,0,0,1]
[109,7,13,"1973-04-14","TKV 59 Heslach Stuttgart I","-","TFG 38 Hildesheim I",null,1973,null,"BECHT, Peter","-","FINK, Michael",null,7,":",6,null,1,0,0]
[110,7,14,"1973-04-14","TKV 59 Heslach Stuttgart I","-","TFG 38 Hildesheim I",null,1973,null,"WÖHR, Hans-Joachim","-","WEDEKIN, Franz",null,2,":",8,null,0,0,1]
[111,7,15,"1973-04-14","TKV 59 Heslach Stuttgart I","-","TFG 38 Hildesheim I",null,1973,null,"SCHMIßRAUTER, Manfred","-","KOCH, Hans-Joachim",null,4,":",3,null,1,0,0]
[112,7,16,"1973-04-14","TKV 59 Heslach Stuttgart I","-","TFG 38 Hildesheim I",null,1973,null,"PFETSCH, Jochem","-","MINNICH, Michael",null,6,":",5,null,1,0,0]
[113,8,1,"1973-04-15","Berliner TV 62 I","-","TFC Kickers Hamburg I",null,1973,null,"LEOPOLD, Wolfgang","-","KNORR, Peter",null,4,":",8,null,0,0,1]
[114,8,2,"1973-04-15","Berliner TV 62 I","-","TFC Kickers Hamburg I",null,1973,null,"KLEINSCHMIDT, Gerd","-","NISSEN, Thomas",null,7,":",8,null,{"$f":"IF(O121>Q121,1,0)","v":0},{"$f":"IF(ISNUMBER(Q121),IF(O121=Q121,1,0),0)","v":0},{"$f":"IF(O121<Q121,1,0)","v":1}]
[115,8,3,"1973-04-15","Berliner TV 62 I","-","TFC Kickers Hamburg I",null,1973,null,"MIETKE, Wilfried","-","MAHNKE, Günter",null,6,":",1,null,1,0,0]
[116,8,4,"1973-04-15","Berliner TV 62 I","-","TFC Kickers Hamburg I",null,1973,null,"KWELLA, Frank","-","CONRING, Olaf",null,4,":",5,null,0,0,1]
[117,8,5,"1973-04-15","Berliner TV 62 I","-","TFC Kickers Hamburg I",null,1973,null,"KLEINSCHMIDT, Gerd","-","KNORR, Peter",null,9,":",10,null,0,0,1]
[118,8,6,"1973-04-15","Berliner TV 62 I","-","TFC Kickers Hamburg I",null,1973,null,"MIETKE, Wilfried","-","NISSEN, Thomas",null,10,":",2,null,1,0,0]
[119,8,7,"1973-04-15","Berliner TV 62 I","-","TFC Kickers Hamburg I",null,1973,null,"KWELLA, Frank","-","MAHNKE, Günter",null,9,":",9,null,0,1,0]
[120,8,8,"1973-04-15","Berliner TV 62 I","-","TFC Kickers Hamburg I",null,1973,null,"LEOPOLD, Wolfgang","-","CONRING, Olaf",null,8,":",7,null,1,0,0]
[121,8,9,"1973-04-15","Berliner TV 62 I","-","TFC Kickers Hamburg I",null,1973,null,"KWELLA, Frank","-","NISSEN, Thomas",null,12,":",7,null,1,0,0]
[122,8,10,"1973-04-15","Berliner TV 62 I","-","TFC Kickers Hamburg I",null,1973,null,"MIETKE, Wilfried","-","KNORR, Peter",null,6,":",5,null,1,0,0]
[123,8,11,"1973-04-15","Berliner TV 62 I","-","TFC Kickers Hamburg I",null,1973,null,"KLEINSCHMIDT, Gerd","-","CONRING, Olaf",null,6,":",5,null,1,0,0]
[124,8,12,"1973-04-15","Berliner TV 62 I","-","TFC Kickers Hamburg I",null,1973,null,"LEOPOLD, Wolfgang","-","MAHNKE, Günter",null,7,":",8,null,0,0,1]
[125,8,13,"1973-04-15","Berliner TV 62 I","-","TFC Kickers Hamburg I",null,1973,null,"LEOPOLD, Wolfgang","-","NISSEN, Thomas",null,3,":",9,null,0,0,1]
[126,8,14,"1973-04-15","Berliner TV 62 I","-","TFC Kickers Hamburg I",null,1973,null,"KWELLA, Frank","-","KNORR, Peter",null,6,":",9,null,0,0,1]
[127,8,15,"1973-04-15","Berliner TV 62 I","-","TFC Kickers Hamburg I",null,1973,null,"MIETKE, Wilfried","-","CONRING, Olaf",null,6,":",1,null,1,0,0]
[128,8,16,"1973-04-15","Berliner TV 62 I","-","TFC Kickers Hamburg I",null,1973,null,"KLEINSCHMIDT, Gerd","-","MAHNKE, Günter",null,6,":",6,null,0,1,0]
[129,9,1,"1973-04-15","Würzburger TKF I","-","TFG 38 Hildesheim I",null,1973,null,"NÖRLING, Karl","-","WEDEKIN, Franz",null,3,":",5,null,0,0,1]
[130,9,2,"1973-04-15","Würzburger TKF I","-","TFG 38 Hildesheim I",null,1973,null,"REUL, Winfried","-","FINK, Michael",null,5,":",7,null,{"$f":"IF(O137>Q137,1,0)","v":0},{"$f":"IF(ISNUMBER(Q137),IF(O137=Q137,1,0),0)","v":0},{"$f":"IF(O137<Q137,1,0)","v":1}]
[131,9,3,"1973-04-15","Würzburger TKF I","-","TFG 38 Hildesheim I",null,1973,null,"BEMERL, Bernd","-","MINNICH, Michael",null,4,":",5,null,0,0,1]
[132,9,4,"1973-04-15","Würzburger TKF I","-","TFG 38 Hildesheim I",null,1973,null,"KLAUS, Robert","-","KOCH, Hans-Joachim",null,7,":",9,null,0,0,1]
[133,9,5,"1973-04-15","Würzburger TKF I","-","TFG 38 Hildesheim I",null,1973,null,"REUL, Winfried","-","WEDEKIN, Franz",null,2,":",8,null,0,0,1]
[134,9,6,"1973-04-15","Würzburger TKF I","-","TFG 38 Hildesheim I",null,1973,null,"BEMERL, Bernd","-","FINK, Michael",null,4,":",2,null,1,0,0]
[135,9,7,"1973-04-15","Würzburger TKF I","-","TFG 38 Hildesheim I",null,1973,null,"KLAUS, Robert","-","MINNICH, Michael",null,3,":",16,null,0,0,1]
[136,9,8,"1973-04-15","Würzburger TKF I","-","TFG 38 Hildesheim I",null,1973,null,"NÖRLING, Karl","-","KOCH, Hans-Joachim",null,6,":",11,null,0,0,1]
[137,9,9,"1973-04-15","Würzburger TKF I","-","TFG 38 Hildesheim I",null,1973,null,"KLAUS, Robert","-","FINK, Michael",null,4,":",3,null,1,0,0]
[138,9,10,"1973-04-15","Würzburger TKF I","-","TFG 38 Hildesheim I",null,1973,null,"BEMERL, Bernd","-","WEDEKIN, Franz",null,1,":",4,null,0,0,1]
[139,9,11,"1973-04-15","Würzburger TKF I","-","TFG 38 Hildesheim I",null,1973,null,"REUL, Winfried","-","KOCH, Hans-Joachim",null,4,":",3,null,1,0,0]
[140,9,12,"1973-04-15","Würzburger TKF I","-","TFG 38 Hildesheim I",null,1973,null,"NÖRLING, Karl","-","MINNICH, Michael",null,4,":",5,null,0,0,1]
[141,9,13,"1973-04-15","Würzburger TKF I","-","TFG 38 Hildesheim I",null,1973,null,"NÖRLING, Karl","-","FINK, Michael",null,3,":",9,null,0,0,1]
[142,9,14,"1973-04-15","Würzburger TKF I","-","TFG 38 Hildesheim I",null,1973,null,"KLAUS, Robert","-","WEDEKIN, Franz",null,4,":",14,null,0,0,1]
[143,9,15,"1973-04-15","Würzburger TKF I","-","TFG 38 Hildesheim I",null,1973,null,"BEMERL, Bernd","-","KOCH, Hans-Joachim",null,4,":",5,null,0,0,1]
[144,9,16,"1973-04-15","Würzburger TKF I","-","TFG 38 Hildesheim I",null,1973,null,"REUL, Winfried","-","MINNICH, Michael",null,6,":",7,null,0,0,1]
[145,10,1,"1973-04-16","TKV 59 Heslach Stuttgart I","-","Würzburger TKF I",null,1973,null,"BECHT, Peter","-","NÖRLING, Karl",null,6,":",8,null,0,0,1]
[146,10,2,"1973-04-16","TKV 59 Heslach Stuttgart I","-","Würzburger TKF I",null,1973,null,"PFETSCH, Jochem","-","REUL, Winfried",null,3,":",8,null,{"$f":"IF(O153>Q153,1,0)","v":0},{"$f":"IF(ISNUMBER(Q153),IF(O153=Q153,1,0),0)","v":0},{"$f":"IF(O153<Q153,1,0)","v":1}]
[147,10,3,"1973-04-16","TKV 59 Heslach Stuttgart I","-","Würzburger TKF I",null,1973,null,"SCHMIßRAUTER, Manfred","-","BEMERL, Bernd",null,5,":",2,null,1,0,0]
[148,10,4,"1973-04-16","TKV 59 Heslach Stuttgart I","-","Würzburger TKF I",null,1973,null,"WÖHR, Hans-Joachim","-","FESER, Manfred",null,8,":",5,null,1,0,0]
[149,10,5,"1973-04-16","TKV 59 Heslach Stuttgart I","-","Würzburger TKF I",null,1973,null,"PFETSCH, Jochem","-","NÖRLING, Karl",null,4,":",9,null,0,0,1]
[150,10,6,"1973-04-16","TKV 59 Heslach Stuttgart I","-","Würzburger TKF I",null,1973,null,"SCHMIßRAUTER, Manfred","-","REUL, Winfried",null,0,":",8,null,0,0,1]
[151,10,7,"1973-04-16","TKV 59 Heslach Stuttgart I","-","Würzburger TKF I",null,1973,null,"WÖHR, Hans-Joachim","-","BEMERL, Bernd",null,6,":",5,null,1,0,0]
[152,10,8,"1973-04-16","TKV 59 Heslach Stuttgart I","-","Würzburger TKF I",null,1973,null,"BECHT, Peter","-","FESER, Manfred",null,10,":",8,null,1,0,0]
[153,10,9,"1973-04-16","TKV 59 Heslach Stuttgart I","-","Würzburger TKF I",null,1973,null,"WÖHR, Hans-Joachim","-","REUL, Winfried",null,4,":",11,null,0,0,1]
[154,10,10,"1973-04-16","TKV 59 Heslach Stuttgart I","-","Würzburger TKF I",null,1973,null,"SCHMIßRAUTER, Manfred","-","NÖRLING, Karl",null,1,":",6,null,0,0,1]
[155,10,11,"1973-04-16","TKV 59 Heslach Stuttgart I","-","Würzburger TKF I",null,1973,null,"PFETSCH, Jochem","-","FESER, Manfred",null,13,":",8,null,1,0,0]
[156,10,12,"1973-04-16","TKV 59 Heslach Stuttgart I","-","Würzburger TKF I",null,1973,null,"BECHT, Peter","-","BEMERL, Bernd",null,6,":",5,null,1,0,0]
[157,10,13,"1973-04-16","TKV 59 Heslach Stuttgart I","-","Würzburger TKF I",null,1973,null,"BECHT, Peter","-","REUL, Winfried",null,3,":",3,null,0,1,0]
[158,10,14,"1973-04-16","TKV 59 Heslach Stuttgart I","-","Würzburger TKF I",null,1973,null,"WÖHR, Hans-Joachim","-","NÖRLING, Karl",null,5,":",9,null,0,0,1]
[159,10,15,"1973-04-16","TKV 59 Heslach Stuttgart I","-","Würzburger TKF I",null,1973,null,"SCHMIßRAUTER, Manfred","-","FESER, Manfred",null,9,":",2,null,1,0,0]
[160,10,16,"1973-04-16","TKV 59 Heslach Stuttgart I","-","Würzburger TKF I",null,1973,null,"PFETSCH, Jochem","-","BEMERL, Bernd",null,6,":",3,null,1,0,0]
[161,11,1,"1973-04-28","TFC Kickers Hamburg I","-","SpVgg. Halbau Berlin I",null,1973,null,"KNORR, Peter","-","DIEKERT, Wolfram",null,3,":",1,null,1,0,0]
[162,11,2,"1973-04-28","TFC Kickers Hamburg I","-","SpVgg. Halbau Berlin I",null,1973,null,"NISSEN, Thomas","-","KOLSKI, Wolfgang",null,3,":",3,null,{"$f":"IF(O169>Q169,1,0)","v":0},{"$f":"IF(ISNUMBER(Q169),IF(O169=Q169,1,0),0)","v":1},{"$f":"IF(O169<Q169,1,0)","v":0}]
[163,11,3,"1973-04-28","TFC Kickers Hamburg I","-","SpVgg. Halbau Berlin I",null,1973,null,"MAHNKE, Günter","-","SUCHAN, Rainer",null,6,":",1,null,1,0,0]
[164,11,4,"1973-04-28","TFC Kickers Hamburg I","-","SpVgg. Halbau Berlin I",null,1973,null,"CONRING, Olaf","-","RÖPKE, Jürgen",null,4,":",2,null,1,0,0]
[165,11,5,"1973-04-28","TFC Kickers Hamburg I","-","SpVgg. Halbau Berlin I",null,1973,null,"NISSEN, Thomas","-","DIEKERT, Wolfram",null,3,":",5,null,0,0,1]
[166,11,6,"1973-04-28","TFC Kickers Hamburg I","-","SpVgg. Halbau Berlin I",null,1973,null,"MAHNKE, Günter","-","KOLSKI, Wolfgang",null,3,":",2,null,1,0,0]
[167,11,7,"1973-04-28","TFC Kickers Hamburg I","-","SpVgg. Halbau Berlin I",null,1973,null,"CONRING, Olaf","-","SUCHAN, Rainer",null,4,":",4,null,0,1,0]
[168,11,8,"1973-04-28","TFC Kickers Hamburg I","-","SpVgg. Halbau Berlin I",null,1973,null,"KNORR, Peter","-","RÖPKE, Jürgen",null,2,":",2,null,0,1,0]
[169,11,9,"1973-04-28","TFC Kickers Hamburg I","-","SpVgg. Halbau Berlin I",null,1973,null,"CONRING, Olaf","-","KOLSKI, Wolfgang",null,3,":",4,null,0,0,1]
[170,11,10,"1973-04-28","TFC Kickers Hamburg I","-","SpVgg. Halbau Berlin I",null,1973,null,"MAHNKE, Günter","-","DIEKERT, Wolfram",null,6,":",3,null,1,0,0]
[171,11,11,"1973-04-28","TFC Kickers Hamburg I","-","SpVgg. Halbau Berlin I",null,1973,null,"NISSEN, Thomas","-","RÖPKE, Jürgen",null,4,":",5,null,0,0,1]
[172,11,12,"1973-04-28","TFC Kickers Hamburg I","-","SpVgg. Halbau Berlin I",null,1973,null,"KNORR, Peter","-","SUCHAN, Rainer",null,6,":",9,null,0,0,1]
[173,11,13,"1973-04-28","TFC Kickers Hamburg I","-","SpVgg. Halbau Berlin I",null,1973,null,"KNORR, Peter","-","KOLSKI, Wolfgang",null,8,":",2,null,1,0,0]
[174,11,14,"1973-04-28","TFC Kickers Hamburg I","-","SpVgg. Halbau Berlin I",null,1973,null,"CONRING, Olaf","-","DIEKERT, Wolfram",null,5,":",5,null,0,1,0]
[175,11,15,"1973-04-28","TFC Kickers Hamburg I","-","SpVgg. Halbau Berlin I",null,1973,null,"MAHNKE, Günter","-","RÖPKE, Jürgen",null,5,":",3,null,1,0,0]
[176,11,16,"1973-04-28","TFC Kickers Hamburg I","-","SpVgg. Halbau Berlin I",null,1973,null,"NISSEN, Thomas","-","SUCHAN, Rainer",null,6,":",2,null,1,0,0]
[177,12,1,"1973-06-02","TKV 59 Heslach Stuttgart I","-","TFC Kickers Hamburg I",null,1973,null,"PFETSCH, Jochem","-","KNORR, Peter",null,4,":",11,null,0,0,1]
[178,12,2,"1973-06-02","TKV 59 Heslach Stuttgart I","-","TFC Kickers Hamburg I",null,1973,null,"GAHM, Hartmut","-","NISSEN, Thomas",null,1,":",5,null,{"$f":"IF(O185>Q185,1,0)","v":0},{"$f":"IF(ISNUMBER(Q185),IF(O185=Q185,1,0),0)","v":0},{"$f":"IF(O185<Q185,1,0)","v":1}]
[179,12,3,"1973-06-02","TKV 59 Heslach Stuttgart I","-","TFC Kickers Hamburg I",null,1973,null,"WÖHR, Hans-Joachim","-","CONRING, Olaf",null,5,":",7,null,0,0,1]
[180,12,4,"1973-06-02","TKV 59 Heslach Stuttgart I","-","TFC Kickers Hamburg I",null,1973,null,"BECHT, Peter","-","MAHNKE, Günter",null,4,":",7,null,0,0,1]
[181,12,5,"1973-06-02","TKV 59 Heslach Stuttgart I","-","TFC Kickers Hamburg I",null,1973,null,"GAHM, Hartmut","-","KNORR, Peter",null,3,":",13,null,0,0,1]
[182,12,6,"1973-06-02","TKV 59 Heslach Stuttgart I","-","TFC Kickers Hamburg I",null,1973,null,"WÖHR, Hans-Joachim","-","NISSEN, Thomas",null,4,":",11,null,0,0,1]
[183,12,7,"1973-06-02","TKV 59 Heslach Stuttgart I","-","TFC Kickers Hamburg I",null,1973,null,"BECHT, Peter","-","CONRING, Olaf",null,7,":",12,null,0,0,1]
[184,12,8,"1973-06-02","TKV 59 Heslach Stuttgart I","-","TFC Kickers Hamburg I",null,1973,null,"PFETSCH, Jochem","-","MAHNKE, Günter",null,5,":",8,null,0,0,1]
[185,12,9,"1973-06-02","TKV 59 Heslach Stuttgart I","-","TFC Kickers Hamburg I",null,1973,null,"BECHT, Peter","-","NISSEN, Thomas",null,11,":",7,null,1,0,0]
[186,12,10,"1973-06-02","TKV 59 Heslach Stuttgart I","-","TFC Kickers Hamburg I",null,1973,null,"WÖHR, Hans-Joachim","-","KNORR, Peter",null,4,":",11,null,0,0,1]
[187,12,11,"1973-06-02","TKV 59 Heslach Stuttgart I","-","TFC Kickers Hamburg I",null,1973,null,"GAHM, Hartmut","-","MAHNKE, Günter",null,6,":",10,null,0,0,1]
[188,12,12,"1973-06-02","TKV 59 Heslach Stuttgart I","-","TFC Kickers Hamburg I",null,1973,null,"PFETSCH, Jochem","-","CONRING, Olaf",null,6,":",11,null,0,0,1]
[189,12,13,"1973-06-02","TKV 59 Heslach Stuttgart I","-","TFC Kickers Hamburg I",null,1973,null,"PFETSCH, Jochem","-","NISSEN, Thomas",null,11,":",13,null,0,0,1]
[190,12,14,"1973-06-02","TKV 59 Heslach Stuttgart I","-","TFC Kickers Hamburg I",null,1973,null,"BECHT, Peter","-","KNORR, Peter",null,8,":",9,null,0,0,1]
[191,12,15,"1973-06-02","TKV 59 Heslach Stuttgart I","-","TFC Kickers Hamburg I",null,1973,null,"WÖHR, Hans-Joachim","-","MAHNKE, Günter",null,5,":",5,null,0,1,0]
[192,12,16,"1973-06-02","TKV 59 Heslach Stuttgart I","-","TFC Kickers Hamburg I",null,1973,null,"GAHM, Hartmut","-","CONRING, Olaf",null,4,":",5,null,0,0,1]
[193,13,1,"1973-06-09","SpVgg. Halbau Berlin I","-","TKV 59 Heslach Stuttgart I",null,1973,null,"DIEKERT, Wolfram","-","BECHT, Peter",null,3,":",4,null,0,0,1]
[194,13,2,"1973-06-09","SpVgg. Halbau Berlin I","-","TKV 59 Heslach Stuttgart I",null,1973,null,"KOLSKI, Wolfgang","-","PFETSCH, Jochem",null,4,":",6,null,{"$f":"IF(O201>Q201,1,0)","v":0},{"$f":"IF(ISNUMBER(Q201),IF(O201=Q201,1,0),0)","v":0},{"$f":"IF(O201<Q201,1,0)","v":1}]
[195,13,3,"1973-06-09","SpVgg. Halbau Berlin I","-","TKV 59 Heslach Stuttgart I",null,1973,null,"RÖPKE, Jürgen","-","SCHMIßRAUTER, Manfred",null,6,":",2,null,1,0,0]
[196,13,4,"1973-06-09","SpVgg. Halbau Berlin I","-","TKV 59 Heslach Stuttgart I",null,1973,null,"SUCHAN, Rainer","-","GAHM, Hartmut",null,7,":",3,null,1,0,0]
[197,13,5,"1973-06-09","SpVgg. Halbau Berlin I","-","TKV 59 Heslach Stuttgart I",null,1973,null,"KOLSKI, Wolfgang","-","BECHT, Peter",null,6,":",3,null,1,0,0]
[198,13,6,"1973-06-09","SpVgg. Halbau Berlin I","-","TKV 59 Heslach Stuttgart I",null,1973,null,"RÖPKE, Jürgen","-","PFETSCH, Jochem",null,5,":",5,null,0,1,0]
[199,13,7,"1973-06-09","SpVgg. Halbau Berlin I","-","TKV 59 Heslach Stuttgart I",null,1973,null,"SUCHAN, Rainer","-","SCHMIßRAUTER, Manfred",null,5,":",3,null,1,0,0]
[200,13,8,"1973-06-09","SpVgg. Halbau Berlin I","-","TKV 59 Heslach Stuttgart I",null,1973,null,"DIEKERT, Wolfram","-","GAHM, Hartmut",null,6,":",2,null,1,0,0]
[201,13,9,"1973-06-09","SpVgg. Halbau Berlin I","-","TKV 59 Heslach Stuttgart I",null,1973,null,"SUCHAN, Rainer","-","PFETSCH, Jochem",null,4,":",7,null,0,0,1]
[202,13,10,"1973-06-09","SpVgg. Halbau Berlin I","-","TKV 59 Heslach Stuttgart I",null,1973,null,"RÖPKE, Jürgen","-","BECHT, Peter",null,5,":",3,null,1,0,0]
[203,13,11,"1973-06-09","SpVgg. Halbau Berlin I","-","TKV 59 Heslach Stuttgart I",null,1973,null,"KOLSKI, Wolfgang","-","GAHM, Hartmut",null,9,":",3,null,1,0,0]
[204,13,12,"1973-06-09","SpVgg. Halbau Berlin I","-","TKV 59 Heslach Stuttgart I",null,1973,null,"DIEKERT, Wolfram","-","SCHMIßRAUTER, Manfred",null,9,":",4,null,1,0,0]
[205,13,13,"1973-06-09","SpVgg. Halbau Berlin I","-","TKV 59 Heslach Stuttgart I",null,1973,null,"DIEKERT, Wolfram","-","PFETSCH, Jochem",null,6,":",13,null,0,0,1]
[206,13,14,"1973-06-09","SpVgg. Halbau Berlin I","-","TKV 59 Heslach Stuttgart I",null,1973,null,"SUCHAN, Rainer","-","BECHT, Peter",null,4,":",2,null,1,0,0]
[207,13,15,"1973-06-09","SpVgg. Halbau Berlin I","-","TKV 59 Heslach Stuttgart I",null,1973,null,"RÖPKE, Jürgen","-","GAHM, Hartmut",null,6,":",4,null,1,0,0]
[208,13,16,"1973-06-09","SpVgg. Halbau Berlin I","-","TKV 59 Heslach Stuttgart I",null,1973,null,"KOLSKI, Wolfgang","-","SCHMIßRAUTER, Manfred",null,7,":",2,null,1,0,0]
[209,14,1,"1973-06-09","Würzburger TKF I","-","TFC Kickers Hamburg I",null,1973,null,"PFEIFFENBERGER, Wolfgang","-","KNORR, Peter",null,6,":",18,null,0,0,1]
[210,14,2,"1973-06-09","Würzburger TKF I","-","TFC Kickers Hamburg I",null,1973,null,"FESER, Manfred","-","NISSEN, Thomas",null,7,":",12,null,{"$f":"IF(O217>Q217,1,0)","v":0},{"$f":"IF(ISNUMBER(Q217),IF(O217=Q217,1,0),0)","v":0},{"$f":"IF(O217<Q217,1,0)","v":1}]
[211,14,3,"1973-06-09","Würzburger TKF I","-","TFC Kickers Hamburg I",null,1973,null,"KLAUS, Robert","-","CONRING, Olaf",null,6,":",10,null,0,0,1]
[212,14,4,"1973-06-09","Würzburger TKF I","-","TFC Kickers Hamburg I",null,1973,null,"NÖRLING, Karl","-","MAHNKE, Günter",null,8,":",8,null,0,1,0]
[213,14,5,"1973-06-09","Würzburger TKF I","-","TFC Kickers Hamburg I",null,1973,null,"FESER, Manfred","-","KNORR, Peter",null,6,":",6,null,0,1,0]
[214,14,6,"1973-06-09","Würzburger TKF I","-","TFC Kickers Hamburg I",null,1973,null,"KLAUS, Robert","-","NISSEN, Thomas",null,5,":",9,null,0,0,1]
[215,14,7,"1973-06-09","Würzburger TKF I","-","TFC Kickers Hamburg I",null,1973,null,"NÖRLING, Karl","-","CONRING, Olaf",null,3,":",12,null,0,0,1]
[216,14,8,"1973-06-09","Würzburger TKF I","-","TFC Kickers Hamburg I",null,1973,null,"PFEIFFENBERGER, Wolfgang","-","MAHNKE, Günter",null,6,":",13,null,0,0,1]
[217,14,9,"1973-06-09","Würzburger TKF I","-","TFC Kickers Hamburg I",null,1973,null,"NÖRLING, Karl","-","NISSEN, Thomas",null,10,":",2,null,1,0,0]
[218,14,10,"1973-06-09","Würzburger TKF I","-","TFC Kickers Hamburg I",null,1973,null,"KLAUS, Robert","-","KNORR, Peter",null,5,":",14,null,0,0,1]
[219,14,11,"1973-06-09","Würzburger TKF I","-","TFC Kickers Hamburg I",null,1973,null,"FESER, Manfred","-","MAHNKE, Günter",null,5,":",12,null,0,0,1]
[220,14,12,"1973-06-09","Würzburger TKF I","-","TFC Kickers Hamburg I",null,1973,null,"PFEIFFENBERGER, Wolfgang","-","CONRING, Olaf",null,4,":",10,null,0,0,1]
[221,14,13,"1973-06-09","Würzburger TKF I","-","TFC Kickers Hamburg I",null,1973,null,"PFEIFFENBERGER, Wolfgang","-","NISSEN, Thomas",null,4,":",10,null,0,0,1]
[222,14,14,"1973-06-09","Würzburger TKF I","-","TFC Kickers Hamburg I",null,1973,null,"NÖRLING, Karl","-","KNORR, Peter",null,4,":",9,null,0,0,1]
[223,14,15,"1973-06-09","Würzburger TKF I","-","TFC Kickers Hamburg I",null,1973,null,"KLAUS, Robert","-","MAHNKE, Günter",null,4,":",17,null,0,0,1]
[224,14,16,"1973-06-09","Würzburger TKF I","-","TFC Kickers Hamburg I",null,1973,null,"FESER, Manfred","-","CONRING, Olaf",null,6,":",6,null,0,1,0]
[225,15,1,"1973-06-10","TFC Kickers Hamburg I","-","TSC Berlin 67 I",null,1973,null,"KNORR, Peter","-","JAKOB, Jörg",null,12,":",6,null,1,0,0]
[226,15,2,"1973-06-10","TFC Kickers Hamburg I","-","TSC Berlin 67 I",null,1973,null,"NISSEN, Thomas","-","SCHÖNFELD, Horst",null,8,":",5,null,{"$f":"IF(O233>Q233,1,0)","v":1},{"$f":"IF(ISNUMBER(Q233),IF(O233=Q233,1,0),0)","v":0},{"$f":"IF(O233<Q233,1,0)","v":0}]
[227,15,3,"1973-06-10","TFC Kickers Hamburg I","-","TSC Berlin 67 I",null,1973,null,"CONRING, Olaf","-","GRÜNEBERG, Manfred",null,1,":",8,null,0,0,1]
[228,15,4,"1973-06-10","TFC Kickers Hamburg I","-","TSC Berlin 67 I",null,1973,null,"MAHNKE, Günter","-","GRÜNEBERG, Klaus-Dieter",null,9,":",7,null,1,0,0]
[229,15,5,"1973-06-10","TFC Kickers Hamburg I","-","TSC Berlin 67 I",null,1973,null,"NISSEN, Thomas","-","JAKOB, Jörg",null,8,":",6,null,1,0,0]
[230,15,6,"1973-06-10","TFC Kickers Hamburg I","-","TSC Berlin 67 I",null,1973,null,"CONRING, Olaf","-","SCHÖNFELD, Horst",null,4,":",7,null,0,0,1]
[231,15,7,"1973-06-10","TFC Kickers Hamburg I","-","TSC Berlin 67 I",null,1973,null,"MAHNKE, Günter","-","GRÜNEBERG, Manfred",null,7,":",1,null,1,0,0]
[232,15,8,"1973-06-10","TFC Kickers Hamburg I","-","TSC Berlin 67 I",null,1973,null,"KNORR, Peter","-","GRÜNEBERG, Klaus-Dieter",null,6,":",4,null,1,0,0]
[233,15,9,"1973-06-10","TFC Kickers Hamburg I","-","TSC Berlin 67 I",null,1973,null,"MAHNKE, Günter","-","SCHÖNFELD, Horst",null,5,":",7,null,0,0,1]
[234,15,10,"1973-06-10","TFC Kickers Hamburg I","-","TSC Berlin 67 I",null,1973,null,"CONRING, Olaf","-","JAKOB, Jörg",null,6,":",5,null,1,0,0]
[235,15,11,"1973-06-10","TFC Kickers Hamburg I","-","TSC Berlin 67 I",null,1973,null,"NISSEN, Thomas","-","GRÜNEBERG, Klaus-Dieter",null,7,":",7,null,0,1,0]
[236,15,12,"1973-06-10","TFC Kickers Hamburg I","-","TSC Berlin 67 I",null,1973,null,"KNORR, Peter","-","GRÜNEBERG, Manfred",null,10,":",5,null,1,0,0]
[237,15,13,"1973-06-10","TFC Kickers Hamburg I","-","TSC Berlin 67 I",null,1973,null,"KNORR, Peter","-","SCHÖNFELD, Horst",null,6,":",4,null,1,0,0]
[238,15,14,"1973-06-10","TFC Kickers Hamburg I","-","TSC Berlin 67 I",null,1973,null,"MAHNKE, Günter","-","JAKOB, Jörg",null,14,":",3,null,1,0,0]
[239,15,15,"1973-06-10","TFC Kickers Hamburg I","-","TSC Berlin 67 I",null,1973,null,"CONRING, Olaf","-","GRÜNEBERG, Klaus-Dieter",null,8,":",5,null,1,0,0]
[240,15,16,"1973-06-10","TFC Kickers Hamburg I","-","TSC Berlin 67 I",null,1973,null,"NISSEN, Thomas","-","GRÜNEBERG, Manfred",null,3,":",9,null,0,0,1]
[241,16,1,"1973-06-10","Würzburger TKF I","-","TSC Berlin 67 I",null,1973,null,"NÖRLING, Karl","-","GRÜNEBERG, Manfred",null,2,":",4,null,0,0,1]
[242,16,2,"1973-06-10","Würzburger TKF I","-","TSC Berlin 67 I",null,1973,null,"FESER, Manfred","-","JAKOB, Jörg",null,8,":",3,null,{"$f":"IF(O249>Q249,1,0)","v":1},{"$f":"IF(ISNUMBER(Q249),IF(O249=Q249,1,0),0)","v":0},{"$f":"IF(O249<Q249,1,0)","v":0}]
[243,16,3,"1973-06-10","Würzburger TKF I","-","TSC Berlin 67 I",null,1973,null,"KLAUS, Robert","-","GRÜNEBERG, Klaus-Dieter",null,1,":",16,null,0,0,1]
[244,16,4,"1973-06-10","Würzburger TKF I","-","TSC Berlin 67 I",null,1973,null,"PFEIFFENBERGER, Wolfgang","-","SCHÖNFELD, Horst",null,2,":",9,null,0,0,1]
[245,16,5,"1973-06-10","Würzburger TKF I","-","TSC Berlin 67 I",null,1973,null,"FESER, Manfred","-","GRÜNEBERG, Manfred",null,0,":",8,null,0,0,1]
[246,16,6,"1973-06-10","Würzburger TKF I","-","TSC Berlin 67 I",null,1973,null,"KLAUS, Robert","-","JAKOB, Jörg",null,4,":",8,null,0,0,1]
[247,16,7,"1973-06-10","Würzburger TKF I","-","TSC Berlin 67 I",null,1973,null,"PFEIFFENBERGER, Wolfgang","-","GRÜNEBERG, Klaus-Dieter",null,8,":",13,null,0,0,1]
[248,16,8,"1973-06-10","Würzburger TKF I","-","TSC Berlin 67 I",null,1973,null,"NÖRLING, Karl","-","SCHÖNFELD, Horst",null,7,":",6,null,1,0,0]
[249,16,9,"1973-06-10","Würzburger TKF I","-","TSC Berlin 67 I",null,1973,null,"PFEIFFENBERGER, Wolfgang","-","JAKOB, Jörg",null,6,":",6,null,0,1,0]
[250,16,10,"1973-06-10","Würzburger TKF I","-","TSC Berlin 67 I",null,1973,null,"KLAUS, Robert","-","GRÜNEBERG, Manfred",null,6,":",10,null,0,0,1]
[251,16,11,"1973-06-10","Würzburger TKF I","-","TSC Berlin 67 I",null,1973,null,"FESER, Manfred","-","SCHÖNFELD, Horst",null,1,":",10,null,0,0,1]
[252,16,12,"1973-06-10","Würzburger TKF I","-","TSC Berlin 67 I",null,1973,null,"NÖRLING, Karl","-","GRÜNEBERG, Klaus-Dieter",null,5,":",6,null,0,0,1]
[253,16,13,"1973-06-10","Würzburger TKF I","-","TSC Berlin 67 I",null,1973,null,"NÖRLING, Karl","-","JAKOB, Jörg",null,5,":",7,null,0,0,1]
[254,16,14,"1973-06-10","Würzburger TKF I","-","TSC Berlin 67 I",null,1973,null,"PFEIFFENBERGER, Wolfgang","-","GRÜNEBERG, Manfred",null,4,":",10,null,0,0,1]
[255,16,15,"1973-06-10","Würzburger TKF I","-","TSC Berlin 67 I",null,1973,null,"KLAUS, Robert","-","SCHÖNFELD, Horst",null,2,":",11,null,0,0,1]
[256,16,16,"1973-06-10","Würzburger TKF I","-","TSC Berlin 67 I",null,1973,null,"FESER, Manfred","-","GRÜNEBERG, Klaus-Dieter",null,5,":",13,null,0,0,1]
[257,17,1,"1973-06-10","TFG 38 Hildesheim I","-","SpVgg. Halbau Berlin I",null,1973,null,"WEDEKIN, Franz","-","DIEKERT, Wolfram",null,7,":",7,null,0,1,0]
[258,17,2,"1973-06-10","TFG 38 Hildesheim I","-","SpVgg. Halbau Berlin I",null,1973,null,"STIEHLER, Ralf","-","SUCHAN, Rainer",null,2,":",5,null,{"$f":"IF(O265>Q265,1,0)","v":0},{"$f":"IF(ISNUMBER(Q265),IF(O265=Q265,1,0),0)","v":0},{"$f":"IF(O265<Q265,1,0)","v":1}]
[259,17,3,"1973-06-10","TFG 38 Hildesheim I","-","SpVgg. Halbau Berlin I",null,1973,null,"MINNICH, Michael","-","KOLSKI, Wolfgang",null,3,":",6,null,0,0,1]
[260,17,4,"1973-06-10","TFG 38 Hildesheim I","-","SpVgg. Halbau Berlin I",null,1973,null,"FINK, Michael","-","RÖPKE, Jürgen",null,5,":",5,null,0,1,0]
[261,17,5,"1973-06-10","TFG 38 Hildesheim I","-","SpVgg. Halbau Berlin I",null,1973,null,"STIEHLER, Ralf","-","DIEKERT, Wolfram",null,11,":",4,null,1,0,0]
[262,17,6,"1973-06-10","TFG 38 Hildesheim I","-","SpVgg. Halbau Berlin I",null,1973,null,"MINNICH, Michael","-","SUCHAN, Rainer",null,5,":",5,null,0,1,0]
[263,17,7,"1973-06-10","TFG 38 Hildesheim I","-","SpVgg. Halbau Berlin I",null,1973,null,"FINK, Michael","-","KOLSKI, Wolfgang",null,11,":",4,null,1,0,0]
[264,17,8,"1973-06-10","TFG 38 Hildesheim I","-","SpVgg. Halbau Berlin I",null,1973,null,"WEDEKIN, Franz","-","RÖPKE, Jürgen",null,4,":",3,null,1,0,0]
[265,17,9,"1973-06-10","TFG 38 Hildesheim I","-","SpVgg. Halbau Berlin I",null,1973,null,"FINK, Michael","-","SUCHAN, Rainer",null,2,":",2,null,0,1,0]
[266,17,10,"1973-06-10","TFG 38 Hildesheim I","-","SpVgg. Halbau Berlin I",null,1973,null,"MINNICH, Michael","-","DIEKERT, Wolfram",null,3,":",3,null,0,1,0]
[267,17,11,"1973-06-10","TFG 38 Hildesheim I","-","SpVgg. Halbau Berlin I",null,1973,null,"STIEHLER, Ralf","-","RÖPKE, Jürgen",null,3,":",3,null,0,1,0]
[268,17,12,"1973-06-10","TFG 38 Hildesheim I","-","SpVgg. Halbau Berlin I",null,1973,null,"WEDEKIN, Franz","-","KOLSKI, Wolfgang",null,6,":",4,null,1,0,0]
[269,17,13,"1973-06-10","TFG 38 Hildesheim I","-","SpVgg. Halbau Berlin I",null,1973,null,"WEDEKIN, Franz","-","SUCHAN, Rainer",null,1,":",2,null,0,0,1]
[270,17,14,"1973-06-10","TFG 38 Hildesheim I","-","SpVgg. Halbau Berlin I",null,1973,null,"FINK, Michael","-","DIEKERT, Wolfram",null,6,":",5,null,1,0,0]
[271,17,15,"1973-06-10","TFG 38 Hildesheim I","-","SpVgg. Halbau Berlin I",null,1973,null,"MINNICH, Michael","-","RÖPKE, Jürgen",null,6,":",4,null,1,0,0]
[272,17,16,"1973-06-10","TFG 38 Hildesheim I","-","SpVgg. Halbau Berlin I",null,1973,null,"STIEHLER, Ralf","-","KOLSKI, Wolfgang",null,4,":",5,null,0,0,1]
[273,18,1,"1973-06-10","Würzburger TKF I","-","SpVgg. Halbau Berlin I",null,1973,null,"NÖRLING, Karl","-","DIEKERT, Wolfram",null,4,":",8,null,0,0,1]
[274,18,2,"1973-06-10","Würzburger TKF I","-","SpVgg. Halbau Berlin I",null,1973,null,"FESER, Manfred","-","SUCHAN, Rainer",null,5,":",6,null,{"$f":"IF(O281>Q281,1,0)","v":0},{"$f":"IF(ISNUMBER(Q281),IF(O281=Q281,1,0),0)","v":0},{"$f":"IF(O281<Q281,1,0)","v":1}]
[275,18,3,"1973-06-10","Würzburger TKF I","-","SpVgg. Halbau Berlin I",null,1973,null,"KLAUS, Robert","-","KOLSKI, Wolfgang",null,2,":",14,null,0,0,1]
[276,18,4,"1973-06-10","Würzburger TKF I","-","SpVgg. Halbau Berlin I",null,1973,null,"PFEIFFENBERGER, Wolfgang","-","RÖPKE, Jürgen",null,4,":",7,null,0,0,1]
[277,18,5,"1973-06-10","Würzburger TKF I","-","SpVgg. Halbau Berlin I",null,1973,null,"FESER, Manfred","-","DIEKERT, Wolfram",null,7,":",9,null,0,0,1]
[278,18,6,"1973-06-10","Würzburger TKF I","-","SpVgg. Halbau Berlin I",null,1973,null,"KLAUS, Robert","-","SUCHAN, Rainer",null,6,":",12,null,0,0,1]
[279,18,7,"1973-06-10","Würzburger TKF I","-","SpVgg. Halbau Berlin I",null,1973,null,"PFEIFFENBERGER, Wolfgang","-","KOLSKI, Wolfgang",null,6,":",13,null,0,0,1]
[280,18,8,"1973-06-10","Würzburger TKF I","-","SpVgg. Halbau Berlin I",null,1973,null,"NÖRLING, Karl","-","RÖPKE, Jürgen",null,9,":",4,null,1,0,0]
[281,18,9,"1973-06-10","Würzburger TKF I","-","SpVgg. Halbau Berlin I",null,1973,null,"PFEIFFENBERGER, Wolfgang","-","SUCHAN, Rainer",null,7,":",8,null,0,0,1]
[282,18,10,"1973-06-10","Würzburger TKF I","-","SpVgg. Halbau Berlin I",null,1973,null,"KLAUS, Robert","-","DIEKERT, Wolfram",null,6,":",4,null,1,0,0]
[283,18,11,"1973-06-10","Würzburger TKF I","-","SpVgg. Halbau Berlin I",null,1973,null,"FESER, Manfred","-","RÖPKE, Jürgen",null,2,":",5,null,0,0,1]
[284,18,12,"1973-06-10","Würzburger TKF I","-","SpVgg. Halbau Berlin I",null,1973,null,"NÖRLING, Karl","-","KOLSKI, Wolfgang",null,5,":",7,null,0,0,1]
[285,18,13,"1973-06-10","Würzburger TKF I","-","SpVgg. Halbau Berlin I",null,1973,null,"NÖRLING, Karl","-","SUCHAN, Rainer",null,6,":",5,null,1,0,0]
[286,18,14,"1973-06-10","Würzburger TKF I","-","SpVgg. Halbau Berlin I",null,1973,null,"PFEIFFENBERGER, Wolfgang","-","DIEKERT, Wolfram",null,6,":",7,null,0,0,1]
[287,18,15,"1973-06-10","Würzburger TKF I","-","SpVgg. Halbau Berlin I",null,1973,null,"KLAUS, Robert","-","RÖPKE, Jürgen",null,2,":",6,null,0,0,1]
[288,18,16,"1973-06-10","Würzburger TKF I","-","SpVgg. Halbau Berlin I",null,1973,null,"FESER, Manfred","-","KOLSKI, Wolfgang",null,7,":",12,null,0,0,1]
[289,19,1,"1973-06-16","TSC Berlin 67 I","-","TFG 38 Hildesheim I",null,1973,null,"GUTTMANN, Peter","-","MINNICH, Michael",null,3,":",3,null,0,1,0]
[290,19,2,"1973-06-16","TSC Berlin 67 I","-","TFG 38 Hildesheim I",null,1973,null,"GRÜNEBERG, Manfred","-","FINK, Michael",null,5,":",10,null,{"$f":"IF(O297>Q297,1,0)","v":0},{"$f":"IF(ISNUMBER(Q297),IF(O297=Q297,1,0),0)","v":0},{"$f":"IF(O297<Q297,1,0)","v":1}]
[291,19,3,"1973-06-16","TSC Berlin 67 I","-","TFG 38 Hildesheim I",null,1973,null,"GRÜNEBERG, Klaus-Dieter","-","WEDEKIN, Franz",null,6,":",6,null,0,1,0]
[292,19,4,"1973-06-16","TSC Berlin 67 I","-","TFG 38 Hildesheim I",null,1973,null,"SCHÖNFELD, Horst","-","RITTER, Uwe",null,6,":",4,null,1,0,0]
[293,19,5,"1973-06-16","TSC Berlin 67 I","-","TFG 38 Hildesheim I",null,1973,null,"GRÜNEBERG, Manfred","-","MINNICH, Michael",null,6,":",12,null,0,0,1]
[294,19,6,"1973-06-16","TSC Berlin 67 I","-","TFG 38 Hildesheim I",null,1973,null,"GRÜNEBERG, Klaus-Dieter","-","FINK, Michael",null,2,":",8,null,0,0,1]
[295,19,7,"1973-06-16","TSC Berlin 67 I","-","TFG 38 Hildesheim I",null,1973,null,"SCHÖNFELD, Horst","-","WEDEKIN, Franz",null,2,":",8,null,0,0,1]
[296,19,8,"1973-06-16","TSC Berlin 67 I","-","TFG 38 Hildesheim I",null,1973,null,"GUTTMANN, Peter","-","RITTER, Uwe",null,4,":",4,null,0,1,0]
[297,19,9,"1973-06-16","TSC Berlin 67 I","-","TFG 38 Hildesheim I",null,1973,null,"SCHÖNFELD, Horst","-","FINK, Michael",null,3,":",8,null,0,0,1]
[298,19,10,"1973-06-16","TSC Berlin 67 I","-","TFG 38 Hildesheim I",null,1973,null,"GRÜNEBERG, Klaus-Dieter","-","MINNICH, Michael",null,5,":",4,null,1,0,0]
[299,19,11,"1973-06-16","TSC Berlin 67 I","-","TFG 38 Hildesheim I",null,1973,null,"GRÜNEBERG, Manfred","-","RITTER, Uwe",null,6,":",6,null,0,1,0]
[300,19,12,"1973-06-16","TSC Berlin 67 I","-","TFG 38 Hildesheim I",null,1973,null,"GUTTMANN, Peter","-","WEDEKIN, Franz",null,7,":",4,null,1,0,0]
[301,19,13,"1973-06-16","TSC Berlin 67 I","-","TFG 38 Hildesheim I",null,1973,null,"GUTTMANN, Peter","-","FINK, Michael",null,5,":",8,null,0,0,1]
[302,19,14,"1973-06-16","TSC Berlin 67 I","-","TFG 38 Hildesheim I",null,1973,null,"SCHÖNFELD, Horst","-","MINNICH, Michael",null,3,":",8,null,0,0,1]
[303,19,15,"1973-06-16","TSC Berlin 67 I","-","TFG 38 Hildesheim I",null,1973,null,"GRÜNEBERG, Klaus-Dieter","-","RITTER, Uwe",null,7,":",5,null,1,0,0]
[304,19,16,"1973-06-16","TSC Berlin 67 I","-","TFG 38 Hildesheim I",null,1973,null,"GRÜNEBERG, Manfred","-","WEDEKIN, Franz",null,3,":",3,null,0,1,0]
[305,20,1,"1973-06-17","Berliner TV 62 I","-","TFG 38 Hildesheim I",null,1973,null,"KLEINSCHMIDT, Gerd","-","WEDEKIN, Franz",null,2,":",11,null,0,0,1]
[306,20,2,"1973-06-17","Berliner TV 62 I","-","TFG 38 Hildesheim I",null,1973,null,"LEOPOLD, Wolfgang","-","FINK, Michael",null,4,":",8,null,{"$f":"IF(O313>Q313,1,0)","v":0},{"$f":"IF(ISNUMBER(Q313),IF(O313=Q313,1,0),0)","v":0},{"$f":"IF(O313<Q313,1,0)","v":1}]
[307,20,3,"1973-06-17","Berliner TV 62 I","-","TFG 38 Hildesheim I",null,1973,null,"MIETKE, Wilfried","-","MINNICH, Michael",null,6,":",5,null,1,0,0]
[308,20,4,"1973-06-17","Berliner TV 62 I","-","TFG 38 Hildesheim I",null,1973,null,"KWELLA, Frank","-","RITTER, Uwe",null,6,":",11,null,0,0,1]
[309,20,5,"1973-06-17","Berliner TV 62 I","-","TFG 38 Hildesheim I",null,1973,null,"LEOPOLD, Wolfgang","-","WEDEKIN, Franz",null,4,":",8,null,0,0,1]
[310,20,6,"1973-06-17","Berliner TV 62 I","-","TFG 38 Hildesheim I",null,1973,null,"MIETKE, Wilfried","-","FINK, Michael",null,5,":",7,null,0,0,1]
[311,20,7,"1973-06-17","Berliner TV 62 I","-","TFG 38 Hildesheim I",null,1973,null,"KWELLA, Frank","-","MINNICH, Michael",null,2,":",13,null,0,0,1]
[312,20,8,"1973-06-17","Berliner TV 62 I","-","TFG 38 Hildesheim I",null,1973,null,"KLEINSCHMIDT, Gerd","-","RITTER, Uwe",null,5,":",4,null,1,0,0]
[313,20,9,"1973-06-17","Berliner TV 62 I","-","TFG 38 Hildesheim I",null,1973,null,"KWELLA, Frank","-","FINK, Michael",null,1,":",13,null,0,0,1]
[314,20,10,"1973-06-17","Berliner TV 62 I","-","TFG 38 Hildesheim I",null,1973,null,"MIETKE, Wilfried","-","WEDEKIN, Franz",null,2,":",7,null,0,0,1]
[315,20,11,"1973-06-17","Berliner TV 62 I","-","TFG 38 Hildesheim I",null,1973,null,"LEOPOLD, Wolfgang","-","RITTER, Uwe",null,5,":",6,null,0,0,1]
[316,20,12,"1973-06-17","Berliner TV 62 I","-","TFG 38 Hildesheim I",null,1973,null,"KLEINSCHMIDT, Gerd","-","MINNICH, Michael",null,3,":",5,null,0,0,1]
[317,20,13,"1973-06-17","Berliner TV 62 I","-","TFG 38 Hildesheim I",null,1973,null,"KLEINSCHMIDT, Gerd","-","FINK, Michael",null,8,":",8,null,0,1,0]
[318,20,14,"1973-06-17","Berliner TV 62 I","-","TFG 38 Hildesheim I",null,1973,null,"KWELLA, Frank","-","WEDEKIN, Franz",null,7,":",14,null,0,0,1]
[319,20,15,"1973-06-17","Berliner TV 62 I","-","TFG 38 Hildesheim I",null,1973,null,"MIETKE, Wilfried","-","RITTER, Uwe",null,5,":",4,null,1,0,0]
[320,20,16,"1973-06-17","Berliner TV 62 I","-","TFG 38 Hildesheim I",null,1973,null,"LEOPOLD, Wolfgang","-","MINNICH, Michael",null,6,":",14,null,0,0,1]
[321,21,1,"1973-08-19","TFG 38 Hildesheim I","-","TFC Kickers Hamburg I",null,1973,null,"FINK, Michael","-","KNORR, Peter",null,9,":",2,null,1,0,0]
[322,21,2,"1973-08-19","TFG 38 Hildesheim I","-","TFC Kickers Hamburg I",null,1973,null,"KOCH, Hans-Joachim","-","NISSEN, Thomas",null,9,":",4,null,{"$f":"IF(O329>Q329,1,0)","v":1},{"$f":"IF(ISNUMBER(Q329),IF(O329=Q329,1,0),0)","v":0},{"$f":"IF(O329<Q329,1,0)","v":0}]
[323,21,3,"1973-08-19","TFG 38 Hildesheim I","-","TFC Kickers Hamburg I",null,1973,null,"WEDEKIN, Franz","-","CONRING, Olaf",null,4,":",5,null,0,0,1]
[324,21,4,"1973-08-19","TFG 38 Hildesheim I","-","TFC Kickers Hamburg I",null,1973,null,"MINNICH, Michael","-","MAHNKE, Günter",null,7,":",3,null,1,0,0]
[325,21,5,"1973-08-19","TFG 38 Hildesheim I","-","TFC Kickers Hamburg I",null,1973,null,"KOCH, Hans-Joachim","-","KNORR, Peter",null,6,":",4,null,1,0,0]
[326,21,6,"1973-08-19","TFG 38 Hildesheim I","-","TFC Kickers Hamburg I",null,1973,null,"WEDEKIN, Franz","-","NISSEN, Thomas",null,9,":",6,null,1,0,0]
[327,21,7,"1973-08-19","TFG 38 Hildesheim I","-","TFC Kickers Hamburg I",null,1973,null,"MINNICH, Michael","-","CONRING, Olaf",null,4,":",7,null,0,0,1]
[328,21,8,"1973-08-19","TFG 38 Hildesheim I","-","TFC Kickers Hamburg I",null,1973,null,"FINK, Michael","-","MAHNKE, Günter",null,9,":",6,null,1,0,0]
[329,21,9,"1973-08-19","TFG 38 Hildesheim I","-","TFC Kickers Hamburg I",null,1973,null,"MINNICH, Michael","-","NISSEN, Thomas",null,10,":",2,null,1,0,0]
[330,21,10,"1973-08-19","TFG 38 Hildesheim I","-","TFC Kickers Hamburg I",null,1973,null,"WEDEKIN, Franz","-","KNORR, Peter",null,10,":",6,null,1,0,0]
[331,21,11,"1973-08-19","TFG 38 Hildesheim I","-","TFC Kickers Hamburg I",null,1973,null,"KOCH, Hans-Joachim","-","MAHNKE, Günter",null,8,":",5,null,1,0,0]
[332,21,12,"1973-08-19","TFG 38 Hildesheim I","-","TFC Kickers Hamburg I",null,1973,null,"FINK, Michael","-","CONRING, Olaf",null,6,":",4,null,1,0,0]
[333,21,13,"1973-08-19","TFG 38 Hildesheim I","-","TFC Kickers Hamburg I",null,1973,null,"FINK, Michael","-","NISSEN, Thomas",null,16,":",5,null,1,0,0]
[334,21,14,"1973-08-19","TFG 38 Hildesheim I","-","TFC Kickers Hamburg I",null,1973,null,"MINNICH, Michael","-","KNORR, Peter",null,5,":",8,null,0,0,1]
[335,21,15,"1973-08-19","TFG 38 Hildesheim I","-","TFC Kickers Hamburg I",null,1973,null,"WEDEKIN, Franz","-","MAHNKE, Günter",null,8,":",1,null,1,0,0]
[336,21,16,"1973-08-19","TFG 38 Hildesheim I","-","TFC Kickers Hamburg I",null,1973,null,"KOCH, Hans-Joachim","-","CONRING, Olaf",null,3,":",4,null,0,0,1]
[null,null,null,null,null,null,null,null,null,null,null,null,null,null,null,null,null,null,0,0,0]
[null,null,null,null,null,null,null,null,null,null,null,null,null,null,null,null,null,null,{"$f":"IF(O345>Q345,1,0)","v":0},{"$f":"IF(ISNUMBER(Q345),IF(O345=Q345,1,0),0)","v":0},{"$f":"IF(O345<Q345,1,0)","v":0}]

{"sheet":"Einzelstatistik_pro_Clubkampf","index":4,"n_rows":175,"n_cols":23,"rows_kept":175,"cut":false,"hidden":false,"merged":[[1,0,1,22]]}
[]
["EINZELSTATISTIK PRO CLUBKAMPF"]
[]
[null,null,null,null,null,null,"GESAMT",null,null,{"$f":"SUBTOTAL(9,J8:J180)","v":305},{"$f":"SUBTOTAL(9,K8:K180)","v":62},{"$f":"SUBTOTAL(9,L8:L180)","v":305},null,null,{"$f":"SUBTOTAL(9,O8:O180)","v":672},":",{"$f":"SUBTOTAL(9,Q8:Q180)","v":672},null,{"$f":"SUBTOTAL(9,S8:S180)","v":3967},":",{"$f":"SUBTOTAL(9,U8:U180)","v":3967},null,{"$f":"SUBTOTAL(9,W8:W180)","v":0}]
[]
["Platz","lf.-Nr.","Name","Datum","gespielt für ","-","Gegner","Saison",null,"S","U","N",null,null,null,"Punkte",null,null,null,"Tore",null,null,"Diff."]
[]
[1,16,"GRÜNEBERG, Klaus-Dieter","1973-06-10","TSC Berlin 67 I","-","Würzburger TKF I",1973,null,4,0,0,null,null,8,":",0,null,48,":",19,null,29]
[2,3,"MIETKE, Wilfried","1973-03-25","Berliner TV 62 I","-","Würzburger TKF I",1973,null,4,0,0,null,null,8,":",0,null,38,":",10,null,28]
[3,18,"KOLSKI, Wolfgang","1973-06-10","SpVgg. Halbau Berlin I","-","Würzburger TKF I",1973,null,4,0,0,null,null,8,":",0,null,46,":",20,null,26]
[4,12,"KNORR, Peter","1973-06-02","TFC Kickers Hamburg I","-","TKV 59 Heslach Stuttgart I",1973,null,4,0,0,null,null,8,":",0,null,44,":",19,null,25]
[5,20,"WEDEKIN, Franz","1973-06-17","TFG 38 Hildesheim I","-","Berliner TV 62 I",1973,null,4,0,0,null,null,8,":",0,null,40,":",15,null,25]
[6,3,"LEOPOLD, Wolfgang","1973-03-25","Berliner TV 62 I","-","Würzburger TKF I",1973,null,4,0,0,null,null,8,":",0,null,35,":",11,null,24]
[7,21,"FINK, Michael","1973-08-19","TFG 38 Hildesheim I","-","TFC Kickers Hamburg I",1973,null,4,0,0,null,null,8,":",0,null,40,":",17,null,23]
[8,7,"WEDEKIN, Franz","1973-04-14","TFG 38 Hildesheim I","-","TKV 59 Heslach Stuttgart I",1973,null,4,0,0,null,null,8,":",0,null,35,":",12,null,23]
[9,9,"WEDEKIN, Franz","1973-04-15","TFG 38 Hildesheim I","-","Würzburger TKF I",1973,null,4,0,0,null,null,8,":",0,null,31,":",10,null,21]
[10,16,"GRÜNEBERG, Manfred","1973-06-10","TSC Berlin 67 I","-","Würzburger TKF I",1973,null,4,0,0,null,null,8,":",0,null,32,":",12,null,20]
[11,19,"FINK, Michael","1973-06-16","TFG 38 Hildesheim I","-","TSC Berlin 67 I",1973,null,4,0,0,null,null,8,":",0,null,34,":",15,null,19]
[12,1,"SUCHAN, Rainer","1973-02-24","SpVgg. Halbau Berlin I","-","Berliner TV 62 I",1973,null,4,0,0,null,null,8,":",0,null,30,":",11,null,19]
[13,8,"MIETKE, Wilfried","1973-04-15","Berliner TV 62 I","-","TFC Kickers Hamburg I",1973,null,4,0,0,null,null,8,":",0,null,28,":",9,null,19]
[14,2,"SCHÖNFELD, Horst","1973-03-18","TSC Berlin 67 I","-","TKV 59 Heslach Stuttgart I",1973,null,4,0,0,null,null,8,":",0,null,36,":",19,null,17]
[15,9,"MINNICH, Michael","1973-04-15","TFG 38 Hildesheim I","-","Würzburger TKF I",1973,null,4,0,0,null,null,8,":",0,null,33,":",17,null,16]
[16,10,"NÖRLING, Karl","1973-04-16","Würzburger TKF I","-","TKV 59 Heslach Stuttgart I",1973,null,4,0,0,null,null,8,":",0,null,32,":",16,null,16]
[17,15,"KNORR, Peter","1973-06-10","TFC Kickers Hamburg I","-","TSC Berlin 67 I",1973,null,4,0,0,null,null,8,":",0,null,34,":",19,null,15]
[18,5,"MIETKE, Wilfried","1973-04-03","Berliner TV 62 I","-","TSC Berlin 67 I",1973,null,4,0,0,null,null,8,":",0,null,26,":",11,null,15]
[19,12,"CONRING, Olaf","1973-06-02","TFC Kickers Hamburg I","-","TKV 59 Heslach Stuttgart I",1973,null,4,0,0,null,null,8,":",0,null,35,":",22,null,13]
[20,1,"RÖPKE, Jürgen","1973-02-24","SpVgg. Halbau Berlin I","-","Berliner TV 62 I",1973,null,4,0,0,null,null,8,":",0,null,25,":",14,null,11]
[21,11,"MAHNKE, Günter","1973-04-28","TFC Kickers Hamburg I","-","SpVgg. Halbau Berlin I",1973,null,4,0,0,null,null,8,":",0,null,20,":",9,null,11]
[22,14,"MAHNKE, Günter","1973-06-09","TFC Kickers Hamburg I","-","Würzburger TKF I",1973,null,3,1,0,null,null,7,":",1,null,50,":",23,null,27]
[23,14,"KNORR, Peter","1973-06-09","TFC Kickers Hamburg I","-","Würzburger TKF I",1973,null,3,1,0,null,null,7,":",1,null,47,":",21,null,26]
[24,10,"REUL, Winfried","1973-04-16","Würzburger TKF I","-","TKV 59 Heslach Stuttgart I",1973,null,3,1,0,null,null,7,":",1,null,30,":",10,null,20]
[25,14,"CONRING, Olaf","1973-06-09","TFC Kickers Hamburg I","-","Würzburger TKF I",1973,null,3,1,0,null,null,7,":",1,null,38,":",19,null,19]
[26,20,"FINK, Michael","1973-06-17","TFG 38 Hildesheim I","-","Berliner TV 62 I",1973,null,3,1,0,null,null,7,":",1,null,36,":",18,null,18]
[27,13,"PFETSCH, Jochem","1973-06-09","TKV 59 Heslach Stuttgart I","-","SpVgg. Halbau Berlin I",1973,null,3,1,0,null,null,7,":",1,null,31,":",19,null,12]
[28,4,"WÖHR, Hans-Joachim","1973-03-25","TKV 59 Heslach Stuttgart I","-","Berliner TV 62 I",1973,null,3,1,0,null,null,7,":",1,null,30,":",18,null,12]
[29,12,"MAHNKE, Günter","1973-06-02","TFC Kickers Hamburg I","-","TKV 59 Heslach Stuttgart I",1973,null,3,1,0,null,null,7,":",1,null,30,":",20,null,10]
[30,13,"RÖPKE, Jürgen","1973-06-09","SpVgg. Halbau Berlin I","-","TKV 59 Heslach Stuttgart I",1973,null,3,1,0,null,null,7,":",1,null,22,":",14,null,8]
[31,6,"DIEKERT, Wolfram","1973-04-11","SpVgg. Halbau Berlin I","-","TSC Berlin 67 I",1973,null,3,1,0,null,null,7,":",1,null,20,":",15,null,5]
[32,16,"SCHÖNFELD, Horst","1973-06-10","TSC Berlin 67 I","-","Würzburger TKF I",1973,null,3,0,1,null,null,6,":",2,null,36,":",12,null,24]
[33,20,"MINNICH, Michael","1973-06-17","TFG 38 Hildesheim I","-","Berliner TV 62 I",1973,null,3,0,1,null,null,6,":",2,null,37,":",17,null,20]
[34,7,"KOCH, Hans-Joachim","1973-04-14","TFG 38 Hildesheim I","-","TKV 59 Heslach Stuttgart I",1973,null,3,0,1,null,null,6,":",2,null,35,":",17,null,18]
[35,15,"MAHNKE, Günter","1973-06-10","TFC Kickers Hamburg I","-","TSC Berlin 67 I",1973,null,3,0,1,null,null,6,":",2,null,35,":",18,null,17]
[36,7,"MINNICH, Michael","1973-04-14","TFG 38 Hildesheim I","-","TKV 59 Heslach Stuttgart I",1973,null,3,0,1,null,null,6,":",2,null,35,":",21,null,14]
[37,2,"GRÜNEBERG, Klaus-Dieter","1973-03-18","TSC Berlin 67 I","-","TKV 59 Heslach Stuttgart I",1973,null,3,0,1,null,null,6,":",2,null,38,":",25,null,13]
[38,21,"WEDEKIN, Franz","1973-08-19","TFG 38 Hildesheim I","-","TFC Kickers Hamburg I",1973,null,3,0,1,null,null,6,":",2,null,31,":",18,null,13]
[39,3,"KLEINSCHMIDT, Gerd","1973-03-25","Berliner TV 62 I","-","Würzburger TKF I",1973,null,3,0,1,null,null,6,":",2,null,30,":",17,null,13]
[40,13,"KOLSKI, Wolfgang","1973-06-09","SpVgg. Halbau Berlin I","-","TKV 59 Heslach Stuttgart I",1973,null,3,0,1,null,null,6,":",2,null,26,":",14,null,12]
[41,4,"SCHMIßRAUTER, Manfred","1973-03-25","TKV 59 Heslach Stuttgart I","-","Berliner TV 62 I",1973,null,3,0,1,null,null,6,":",2,null,35,":",24,null,11]
[42,12,"NISSEN, Thomas","1973-06-02","TFC Kickers Hamburg I","-","TKV 59 Heslach Stuttgart I",1973,null,3,0,1,null,null,6,":",2,null,36,":",27,null,9]
[43,21,"KOCH, Hans-Joachim","1973-08-19","TFG 38 Hildesheim I","-","TFC Kickers Hamburg I",1973,null,3,0,1,null,null,6,":",2,null,26,":",17,null,9]
[44,5,"SCHÖNFELD, Horst","1973-04-03","TSC Berlin 67 I","-","Berliner TV 62 I",1973,null,3,0,1,null,null,6,":",2,null,24,":",15,null,9]
[45,6,"GRÜNEBERG, Manfred","1973-04-11","TSC Berlin 67 I","-","SpVgg. Halbau Berlin I",1973,null,3,0,1,null,null,6,":",2,null,21,":",12,null,9]
[46,17,"FINK, Michael","1973-06-10","TFG 38 Hildesheim I","-","SpVgg. Halbau Berlin I",1973,null,2,2,0,null,null,6,":",2,null,24,":",16,null,8]
[47,14,"NISSEN, Thomas","1973-06-09","TFC Kickers Hamburg I","-","Würzburger TKF I",1973,null,3,0,1,null,null,6,":",2,null,33,":",26,null,7]
[48,8,"KNORR, Peter","1973-04-15","TFC Kickers Hamburg I","-","Berliner TV 62 I",1973,null,3,0,1,null,null,6,":",2,null,32,":",25,null,7]
[49,18,"SUCHAN, Rainer","1973-06-10","SpVgg. Halbau Berlin I","-","Würzburger TKF I",1973,null,3,0,1,null,null,6,":",2,null,31,":",24,null,7]
[50,9,"KOCH, Hans-Joachim","1973-04-15","TFG 38 Hildesheim I","-","Würzburger TKF I",1973,null,3,0,1,null,null,6,":",2,null,28,":",21,null,7]
[51,2,"GRÜNEBERG, Manfred","1973-03-18","TSC Berlin 67 I","-","TKV 59 Heslach Stuttgart I",1973,null,3,0,1,null,null,6,":",2,null,29,":",23,null,6]
[52,7,"FINK, Michael","1973-04-14","TFG 38 Hildesheim I","-","TKV 59 Heslach Stuttgart I",1973,null,3,0,1,null,null,6,":",2,null,29,":",24,null,5]
[53,18,"DIEKERT, Wolfram","1973-06-10","SpVgg. Halbau Berlin I","-","Würzburger TKF I",1973,null,3,0,1,null,null,6,":",2,null,28,":",23,null,5]
[54,18,"RÖPKE, Jürgen","1973-06-10","SpVgg. Halbau Berlin I","-","Würzburger TKF I",1973,null,3,0,1,null,null,6,":",2,null,22,":",17,null,5]
[55,1,"KOLSKI, Wolfgang","1973-02-24","SpVgg. Halbau Berlin I","-","Berliner TV 62 I",1973,null,3,0,1,null,null,6,":",2,null,21,":",16,null,5]
[56,13,"SUCHAN, Rainer","1973-06-09","SpVgg. Halbau Berlin I","-","TKV 59 Heslach Stuttgart I",1973,null,3,0,1,null,null,6,":",2,null,20,":",15,null,5]
[57,17,"SUCHAN, Rainer","1973-06-10","SpVgg. Halbau Berlin I","-","TFG 38 Hildesheim I",1973,null,2,2,0,null,null,6,":",2,null,14,":",10,null,4]
[58,21,"CONRING, Olaf","1973-08-19","TFC Kickers Hamburg I","-","TFG 38 Hildesheim I",1973,null,3,0,1,null,null,6,":",2,null,20,":",17,null,3]
[59,5,"MELISS, Dieter","1973-04-03","TSC Berlin 67 I","-","Berliner TV 62 I",1973,null,3,0,1,null,null,6,":",2,null,27,":",26,null,1]
[60,4,"LEOPOLD, Wolfgang","1973-03-25","Berliner TV 62 I","-","TKV 59 Heslach Stuttgart I",1973,null,3,0,1,null,null,6,":",2,null,19,":",20,null,-1]
[61,19,"MINNICH, Michael","1973-06-16","TFG 38 Hildesheim I","-","TSC Berlin 67 I",1973,null,2,1,1,null,null,5,":",3,null,27,":",17,null,10]
[62,11,"KNORR, Peter","1973-04-28","TFC Kickers Hamburg I","-","SpVgg. Halbau Berlin I",1973,null,2,1,1,null,null,5,":",3,null,19,":",14,null,5]
[63,6,"KOLSKI, Wolfgang","1973-04-11","SpVgg. Halbau Berlin I","-","TSC Berlin 67 I",1973,null,2,1,1,null,null,5,":",3,null,21,":",17,null,4]
[64,17,"WEDEKIN, Franz","1973-06-10","TFG 38 Hildesheim I","-","SpVgg. Halbau Berlin I",1973,null,2,1,1,null,null,5,":",3,null,18,":",16,null,2]
[65,10,"BECHT, Peter","1973-04-16","TKV 59 Heslach Stuttgart I","-","Würzburger TKF I",1973,null,2,1,1,null,null,5,":",3,null,25,":",24,null,1]
[66,16,"JAKOB, Jörg","1973-06-10","TSC Berlin 67 I","-","Würzburger TKF I",1973,null,2,1,1,null,null,5,":",3,null,24,":",23,null,1]
[67,6,"GRÜNEBERG, Klaus-Dieter","1973-04-11","TSC Berlin 67 I","-","SpVgg. Halbau Berlin I",1973,null,1,3,0,null,null,5,":",3,null,16,":",15,null,1]
[68,15,"NISSEN, Thomas","1973-06-10","TFC Kickers Hamburg I","-","TSC Berlin 67 I",1973,null,2,1,1,null,null,5,":",3,null,26,":",27,null,-1]
[69,19,"GRÜNEBERG, Klaus-Dieter","1973-06-16","TSC Berlin 67 I","-","TFG 38 Hildesheim I",1973,null,2,1,1,null,null,5,":",3,null,20,":",23,null,-3]
[70,5,"GRÜNEBERG, Manfred","1973-04-03","TSC Berlin 67 I","-","Berliner TV 62 I",1973,null,2,0,2,null,null,4,":",4,null,25,":",16,null,9]
[71,5,"GRÜNEBERG, Klaus-Dieter","1973-04-03","TSC Berlin 67 I","-","Berliner TV 62 I",1973,null,2,0,2,null,null,4,":",4,null,23,":",16,null,7]
[72,21,"MINNICH, Michael","1973-08-19","TFG 38 Hildesheim I","-","TFC Kickers Hamburg I",1973,null,2,0,2,null,null,4,":",4,null,26,":",20,null,6]
[73,6,"RÖPKE, Jürgen","1973-04-11","SpVgg. Halbau Berlin I","-","TSC Berlin 67 I",1973,null,2,0,2,null,null,4,":",4,null,24,":",18,null,6]
[74,9,"FINK, Michael","1973-04-15","TFG 38 Hildesheim I","-","Würzburger TKF I",1973,null,2,0,2,null,null,4,":",4,null,21,":",16,null,5]
[75,20,"RITTER, Uwe","1973-06-17","TFG 38 Hildesheim I","-","Berliner TV 62 I",1973,null,2,0,2,null,null,4,":",4,null,25,":",21,null,4]
[76,19,"WEDEKIN, Franz","1973-06-16","TFG 38 Hildesheim I","-","TSC Berlin 67 I",1973,null,1,2,1,null,null,4,":",4,null,21,":",18,null,3]
[77,2,"PFETSCH, Jochem","1973-03-18","TKV 59 Heslach Stuttgart I","-","TSC Berlin 67 I",1973,null,2,0,2,null,null,4,":",4,null,34,":",32,null,2]
[78,15,"GRÜNEBERG, Manfred","1973-06-10","TSC Berlin 67 I","-","TFC Kickers Hamburg I",1973,null,2,0,2,null,null,4,":",4,null,23,":",21,null,2]
[79,2,"JAKOB, Jörg","1973-03-18","TSC Berlin 67 I","-","TKV 59 Heslach Stuttgart I",1973,null,2,0,2,null,null,4,":",4,null,23,":",21,null,2]
[80,13,"DIEKERT, Wolfram","1973-06-09","SpVgg. Halbau Berlin I","-","TKV 59 Heslach Stuttgart I",1973,null,2,0,2,null,null,4,":",4,null,24,":",23,null,1]
[81,11,"CONRING, Olaf","1973-04-28","TFC Kickers Hamburg I","-","SpVgg. Halbau Berlin I",1973,null,1,2,1,null,null,4,":",4,null,16,":",15,null,1]
[82,18,"NÖRLING, Karl","1973-06-10","Würzburger TKF I","-","SpVgg. Halbau Berlin I",1973,null,2,0,2,null,null,4,":",4,null,24,":",24,null,0]
[83,15,"SCHÖNFELD, Horst","1973-06-10","TSC Berlin 67 I","-","TFC Kickers Hamburg I",1973,null,2,0,2,null,null,4,":",4,null,23,":",23,null,0]
[84,19,"GUTTMANN, Peter","1973-06-16","TSC Berlin 67 I","-","TFG 38 Hildesheim I",1973,null,1,2,1,null,null,4,":",4,null,19,":",19,null,0]
[85,17,"MINNICH, Michael","1973-06-10","TFG 38 Hildesheim I","-","SpVgg. Halbau Berlin I",1973,null,1,2,1,null,null,4,":",4,null,17,":",18,null,-1]
[86,10,"PFETSCH, Jochem","1973-04-16","TKV 59 Heslach Stuttgart I","-","Würzburger TKF I",1973,null,2,0,2,null,null,4,":",4,null,26,":",28,null,-2]
[87,1,"DIEKERT, Wolfram","1973-02-24","SpVgg. Halbau Berlin I","-","Berliner TV 62 I",1973,null,2,0,2,null,null,4,":",4,null,22,":",24,null,-2]
[88,5,"KLEINSCHMIDT, Gerd","1973-04-03","Berliner TV 62 I","-","TSC Berlin 67 I",1973,null,2,0,2,null,null,4,":",4,null,25,":",28,null,-3]
[89,1,"MIETKE, Wilfried","1973-02-24","Berliner TV 62 I","-","SpVgg. Halbau Berlin I",1973,null,2,0,2,null,null,4,":",4,null,19,":",22,null,-3]
[90,10,"SCHMIßRAUTER, Manfred","1973-04-16","TKV 59 Heslach Stuttgart I","-","Würzburger TKF I",1973,null,2,0,2,null,null,4,":",4,null,15,":",18,null,-3]
[91,8,"MAHNKE, Günter","1973-04-15","TFC Kickers Hamburg I","-","Berliner TV 62 I",1973,null,1,2,1,null,null,4,":",4,null,24,":",28,null,-4]
[92,4,"GRIMM, Walter","1973-03-25","Berliner TV 62 I","-","TKV 59 Heslach Stuttgart I",1973,null,2,0,2,null,null,4,":",4,null,23,":",28,null,-5]
[93,17,"KOLSKI, Wolfgang","1973-06-10","SpVgg. Halbau Berlin I","-","TFG 38 Hildesheim I",1973,null,2,0,2,null,null,4,":",4,null,19,":",24,null,-5]
[94,20,"MIETKE, Wilfried","1973-06-17","Berliner TV 62 I","-","TFG 38 Hildesheim I",1973,null,2,0,2,null,null,4,":",4,null,18,":",23,null,-5]
[95,8,"NISSEN, Thomas","1973-04-15","TFC Kickers Hamburg I","-","Berliner TV 62 I",1973,null,2,0,2,null,null,4,":",4,null,26,":",32,null,-6]
[96,15,"CONRING, Olaf","1973-06-10","TFC Kickers Hamburg I","-","TSC Berlin 67 I",1973,null,2,0,2,null,null,4,":",4,null,19,":",25,null,-6]
[97,10,"WÖHR, Hans-Joachim","1973-04-16","TKV 59 Heslach Stuttgart I","-","Würzburger TKF I",1973,null,2,0,2,null,null,4,":",4,null,23,":",30,null,-7]
[98,3,"NÖRLING, Karl","1973-03-25","Würzburger TKF I","-","Berliner TV 62 I",1973,null,2,0,2,null,null,4,":",4,null,16,":",32,null,-16]
[99,17,"STIEHLER, Ralf","1973-06-10","TFG 38 Hildesheim I","-","SpVgg. Halbau Berlin I",1973,null,1,1,2,null,null,3,":",5,null,20,":",17,null,3]
[100,8,"KWELLA, Frank","1973-04-15","Berliner TV 62 I","-","TFC Kickers Hamburg I",1973,null,1,1,2,null,null,3,":",5,null,31,":",30,null,1]
[101,6,"SUCHAN, Rainer","1973-04-11","SpVgg. Halbau Berlin I","-","TSC Berlin 67 I",1973,null,1,1,2,null,null,3,":",5,null,19,":",18,null,1]
[102,11,"NISSEN, Thomas","1973-04-28","TFC Kickers Hamburg I","-","SpVgg. Halbau Berlin I",1973,null,1,1,2,null,null,3,":",5,null,16,":",15,null,1]
[103,8,"KLEINSCHMIDT, Gerd","1973-04-15","Berliner TV 62 I","-","TFC Kickers Hamburg I",1973,null,1,1,2,null,null,3,":",5,null,28,":",29,null,-1]
[104,4,"MIETKE, Wilfried","1973-03-25","Berliner TV 62 I","-","TKV 59 Heslach Stuttgart I",1973,null,1,1,2,null,null,3,":",5,null,20,":",22,null,-2]
[105,4,"KLEINSCHMIDT, Gerd","1973-03-25","Berliner TV 62 I","-","TKV 59 Heslach Stuttgart I",1973,null,1,1,2,null,null,3,":",5,null,25,":",28,null,-3]
[106,11,"DIEKERT, Wolfram","1973-04-28","SpVgg. Halbau Berlin I","-","TFC Kickers Hamburg I",1973,null,1,1,2,null,null,3,":",5,null,14,":",17,null,-3]
[107,11,"RÖPKE, Jürgen","1973-04-28","SpVgg. Halbau Berlin I","-","TFC Kickers Hamburg I",1973,null,1,1,2,null,null,3,":",5,null,12,":",15,null,-3]
[108,14,"NÖRLING, Karl","1973-06-09","Würzburger TKF I","-","TFC Kickers Hamburg I",1973,null,1,1,2,null,null,3,":",5,null,25,":",31,null,-6]
[109,11,"SUCHAN, Rainer","1973-04-28","SpVgg. Halbau Berlin I","-","TFC Kickers Hamburg I",1973,null,1,1,2,null,null,3,":",5,null,16,":",22,null,-6]
[110,11,"KOLSKI, Wolfgang","1973-04-28","SpVgg. Halbau Berlin I","-","TFC Kickers Hamburg I",1973,null,1,1,2,null,null,3,":",5,null,11,":",17,null,-6]
[111,20,"KLEINSCHMIDT, Gerd","1973-06-17","Berliner TV 62 I","-","TFG 38 Hildesheim I",1973,null,1,1,2,null,null,3,":",5,null,18,":",28,null,-10]
[112,4,"BECHT, Peter","1973-03-25","TKV 59 Heslach Stuttgart I","-","Berliner TV 62 I",1973,null,1,0,3,null,null,2,":",6,null,13,":",15,null,-2]
[113,17,"RÖPKE, Jürgen","1973-06-10","SpVgg. Halbau Berlin I","-","TFG 38 Hildesheim I",1973,null,0,2,2,null,null,2,":",6,null,15,":",18,null,-3]
[114,9,"BEMERL, Bernd","1973-04-15","Würzburger TKF I","-","TFG 38 Hildesheim I",1973,null,1,0,3,null,null,2,":",6,null,13,":",16,null,-3]
[115,19,"RITTER, Uwe","1973-06-16","TFG 38 Hildesheim I","-","TSC Berlin 67 I",1973,null,0,2,2,null,null,2,":",6,null,19,":",23,null,-4]
[116,16,"NÖRLING, Karl","1973-06-10","Würzburger TKF I","-","TSC Berlin 67 I",1973,null,1,0,3,null,null,2,":",6,null,19,":",23,null,-4]
[117,12,"BECHT, Peter","1973-06-02","TKV 59 Heslach Stuttgart I","-","TFC Kickers Hamburg I",1973,null,1,0,3,null,null,2,":",6,null,30,":",35,null,-5]
[118,8,"CONRING, Olaf","1973-04-15","TFC Kickers Hamburg I","-","Berliner TV 62 I",1973,null,1,0,3,null,null,2,":",6,null,18,":",24,null,-6]
[119,3,"BEMERL, Bernd","1973-03-25","Würzburger TKF I","-","Berliner TV 62 I",1973,null,1,0,3,null,null,2,":",6,null,16,":",22,null,-6]
[120,13,"BECHT, Peter","1973-06-09","TKV 59 Heslach Stuttgart I","-","SpVgg. Halbau Berlin I",1973,null,1,0,3,null,null,2,":",6,null,12,":",18,null,-6]
[121,17,"DIEKERT, Wolfram","1973-06-10","SpVgg. Halbau Berlin I","-","TFG 38 Hildesheim I",1973,null,0,2,2,null,null,2,":",6,null,19,":",27,null,-8]
[122,9,"REUL, Winfried","1973-04-15","Würzburger TKF I","-","TFG 38 Hildesheim I",1973,null,1,0,3,null,null,2,":",6,null,17,":",25,null,-8]
[123,1,"LEOPOLD, Wolfgang","1973-02-24","Berliner TV 62 I","-","SpVgg. Halbau Berlin I",1973,null,1,0,3,null,null,2,":",6,null,17,":",25,null,-8]
[124,7,"SCHMIßRAUTER, Manfred","1973-04-14","TKV 59 Heslach Stuttgart I","-","TFG 38 Hildesheim I",1973,null,1,0,3,null,null,2,":",6,null,18,":",27,null,-9]
[125,3,"GRIMM, Walter","1973-03-25","Berliner TV 62 I","-","Würzburger TKF I",1973,null,1,0,3,null,null,2,":",6,null,16,":",25,null,-9]
[126,8,"LEOPOLD, Wolfgang","1973-04-15","Berliner TV 62 I","-","TFC Kickers Hamburg I",1973,null,1,0,3,null,null,2,":",6,null,22,":",32,null,-10]
[127,21,"KNORR, Peter","1973-08-19","TFC Kickers Hamburg I","-","TFG 38 Hildesheim I",1973,null,1,0,3,null,null,2,":",6,null,20,":",30,null,-10]
[128,3,"REUL, Winfried","1973-03-25","Würzburger TKF I","-","Berliner TV 62 I",1973,null,1,0,3,null,null,2,":",6,null,15,":",25,null,-10]
[129,19,"GRÜNEBERG, Manfred","1973-06-16","TSC Berlin 67 I","-","TFG 38 Hildesheim I",1973,null,0,2,2,null,null,2,":",6,null,20,":",31,null,-11]
[130,14,"FESER, Manfred","1973-06-09","Würzburger TKF I","-","TFC Kickers Hamburg I",1973,null,0,2,2,null,null,2,":",6,null,24,":",36,null,-12]
[131,6,"MELISS, Dieter","1973-04-11","TSC Berlin 67 I","-","SpVgg. Halbau Berlin I",1973,null,1,0,3,null,null,2,":",6,null,21,":",34,null,-13]
[132,7,"BECHT, Peter","1973-04-14","TKV 59 Heslach Stuttgart I","-","TFG 38 Hildesheim I",1973,null,1,0,3,null,null,2,":",6,null,21,":",35,null,-14]
[133,2,"WÖHR, Hans-Joachim","1973-03-18","TKV 59 Heslach Stuttgart I","-","TSC Berlin 67 I",1973,null,1,0,3,null,null,2,":",6,null,21,":",35,null,-14]
[134,2,"WAHL, Günther","1973-03-18","TKV 59 Heslach Stuttgart I","-","TSC Berlin 67 I",1973,null,1,0,3,null,null,2,":",6,null,19,":",33,null,-14]
[135,19,"SCHÖNFELD, Horst","1973-06-16","TSC Berlin 67 I","-","TFG 38 Hildesheim I",1973,null,1,0,3,null,null,2,":",6,null,14,":",28,null,-14]
[136,7,"PFETSCH, Jochem","1973-04-14","TKV 59 Heslach Stuttgart I","-","TFG 38 Hildesheim I",1973,null,1,0,3,null,null,2,":",6,null,17,":",33,null,-16]
[137,18,"KLAUS, Robert","1973-06-10","Würzburger TKF I","-","SpVgg. Halbau Berlin I",1973,null,1,0,3,null,null,2,":",6,null,16,":",36,null,-20]
[138,16,"FESER, Manfred","1973-06-10","Würzburger TKF I","-","TSC Berlin 67 I",1973,null,1,0,3,null,null,2,":",6,null,14,":",34,null,-20]
[139,9,"KLAUS, Robert","1973-04-15","Würzburger TKF I","-","TFG 38 Hildesheim I",1973,null,1,0,3,null,null,2,":",6,null,18,":",42,null,-24]
[140,15,"GRÜNEBERG, Klaus-Dieter","1973-06-10","TSC Berlin 67 I","-","TFC Kickers Hamburg I",1973,null,0,1,3,null,null,1,":",7,null,23,":",30,null,-7]
[141,4,"PFETSCH, Jochem","1973-03-25","TKV 59 Heslach Stuttgart I","-","Berliner TV 62 I",1973,null,0,1,3,null,null,1,":",7,null,20,":",30,null,-10]
[142,12,"WÖHR, Hans-Joachim","1973-06-02","TKV 59 Heslach Stuttgart I","-","TFC Kickers Hamburg I",1973,null,0,1,3,null,null,1,":",7,null,18,":",34,null,-16]
[143,16,"PFEIFFENBERGER, Wolfgang","1973-06-10","Würzburger TKF I","-","TSC Berlin 67 I",1973,null,0,1,3,null,null,1,":",7,null,20,":",38,null,-18]
[144,1,"MIETKE, Reinhard","1973-02-24","Berliner TV 62 I","-","SpVgg. Halbau Berlin I",1973,null,0,0,4,null,null,0,":",8,null,11,":",18,null,-7]
[145,10,"BEMERL, Bernd","1973-04-16","Würzburger TKF I","-","TKV 59 Heslach Stuttgart I",1973,null,0,0,4,null,null,0,":",8,null,15,":",23,null,-8]
[146,18,"FESER, Manfred","1973-06-10","Würzburger TKF I","-","SpVgg. Halbau Berlin I",1973,null,0,0,4,null,null,0,":",8,null,21,":",32,null,-11]
[147,18,"PFEIFFENBERGER, Wolfgang","1973-06-10","Würzburger TKF I","-","SpVgg. Halbau Berlin I",1973,null,0,0,4,null,null,0,":",8,null,23,":",35,null,-12]
[148,2,"SCHMIßRAUTER, Manfred","1973-03-18","TKV 59 Heslach Stuttgart I","-","TSC Berlin 67 I",1973,null,0,0,4,null,null,0,":",8,null,14,":",26,null,-12]
[149,6,"GUTTMANN, Peter","1973-04-11","TSC Berlin 67 I","-","SpVgg. Halbau Berlin I",1973,null,0,0,4,null,null,0,":",8,null,10,":",23,null,-13]
[150,9,"NÖRLING, Karl","1973-04-15","Würzburger TKF I","-","TFG 38 Hildesheim I",1973,null,0,0,4,null,null,0,":",8,null,16,":",30,null,-14]
[151,1,"KLEINSCHMIDT, Gerd","1973-02-24","Berliner TV 62 I","-","SpVgg. Halbau Berlin I",1973,null,0,0,4,null,null,0,":",8,null,18,":",33,null,-15]
[152,5,"MIETKE, Reinhard","1973-04-03","Berliner TV 62 I","-","TSC Berlin 67 I",1973,null,0,0,4,null,null,0,":",8,null,12,":",27,null,-15]
[153,13,"GAHM, Hartmut","1973-06-09","TKV 59 Heslach Stuttgart I","-","SpVgg. Halbau Berlin I",1973,null,0,0,4,null,null,0,":",8,null,12,":",28,null,-16]
[154,13,"SCHMIßRAUTER, Manfred","1973-06-09","TKV 59 Heslach Stuttgart I","-","SpVgg. Halbau Berlin I",1973,null,0,0,4,null,null,0,":",8,null,11,":",27,null,-16]
[155,12,"PFETSCH, Jochem","1973-06-02","TKV 59 Heslach Stuttgart I","-","TFC Kickers Hamburg I",1973,null,0,0,4,null,null,0,":",8,null,26,":",43,null,-17]
[156,10,"FESER, Manfred","1973-04-16","Würzburger TKF I","-","TKV 59 Heslach Stuttgart I",1973,null,0,0,4,null,null,0,":",8,null,23,":",40,null,-17]
[157,20,"LEOPOLD, Wolfgang","1973-06-17","Berliner TV 62 I","-","TFG 38 Hildesheim I",1973,null,0,0,4,null,null,0,":",8,null,19,":",36,null,-17]
[158,21,"MAHNKE, Günter","1973-08-19","TFC Kickers Hamburg I","-","TFG 38 Hildesheim I",1973,null,0,0,4,null,null,0,":",8,null,15,":",32,null,-17]
[159,12,"GAHM, Hartmut","1973-06-02","TKV 59 Heslach Stuttgart I","-","TFC Kickers Hamburg I",1973,null,0,0,4,null,null,0,":",8,null,14,":",33,null,-19]
[160,15,"JAKOB, Jörg","1973-06-10","TSC Berlin 67 I","-","TFC Kickers Hamburg I",1973,null,0,0,4,null,null,0,":",8,null,20,":",40,null,-20]
[161,7,"WÖHR, Hans-Joachim","1973-04-14","TKV 59 Heslach Stuttgart I","-","TFG 38 Hildesheim I",1973,null,0,0,4,null,null,0,":",8,null,18,":",39,null,-21]
[162,5,"KWELLA, Frank","1973-04-03","Berliner TV 62 I","-","TSC Berlin 67 I",1973,null,0,0,4,null,null,0,":",8,null,10,":",33,null,-23]
[163,3,"PFEIFFENBERGER, Wolfgang","1973-03-25","Würzburger TKF I","-","Berliner TV 62 I",1973,null,0,0,4,null,null,0,":",8,null,16,":",40,null,-24]
[164,21,"NISSEN, Thomas","1973-08-19","TFC Kickers Hamburg I","-","TFG 38 Hildesheim I",1973,null,0,0,4,null,null,0,":",8,null,17,":",44,null,-27]
[165,14,"KLAUS, Robert","1973-06-09","Würzburger TKF I","-","TFC Kickers Hamburg I",1973,null,0,0,4,null,null,0,":",8,null,20,":",50,null,-30]
[166,14,"PFEIFFENBERGER, Wolfgang","1973-06-09","Würzburger TKF I","-","TFC Kickers Hamburg I",1973,null,0,0,4,null,null,0,":",8,null,20,":",51,null,-31]
[167,16,"KLAUS, Robert","1973-06-10","Würzburger TKF I","-","TSC Berlin 67 I",1973,null,0,0,4,null,null,0,":",8,null,13,":",45,null,-32]
[168,20,"KWELLA, Frank","1973-06-17","Berliner TV 62 I","-","TFG 38 Hildesheim I",1973,null,0,0,4,null,null,0,":",8,null,16,":",51,null,-35]

{"sheet":"Einzelstatistik_pro_Saison","index":5,"n_rows":45,"n_cols":26,"rows_kept":45,"cut":false,"hidden":false,"merged":[[1,0,1,25]]}
[]
["EINZELSTATISTIK PRO SAISON"]
[]
[null,null,"GESAMT",null,{"$f":"SUBTOTAL(9,E8:E47)","v":168},{"$f":"SUBTOTAL(9,F8:F47)","v":672},null,{"$f":"SUBTOTAL(9,H8:H47)","v":305},{"$f":"SUBTOTAL(9,I8:I47)","v":62},{"$f":"SUBTOTAL(9,J8:J47)","v":305},null,{"$f":"SUBTOTAL(9,L8:L47)","v":672},":",{"$f":"SUBTOTAL(9,N8:N47)","v":672},null,{"$f":"SUBTOTAL(9,P8:P47)","v":3967},":",{"$f":"SUBTOTAL(9,R8:R47)","v":3967},null,{"$f":"SUBTOTAL(9,T8:T47)","v":0},null,null,null,null,"Durchschnitt"]
[]
["Platz",null,"Mannschaft","Saison","Match","Spiele",null,"S","U","N",null,null,"Punkte",null,null,null,"Tore",null,null,"Diff.",null,"Punkte",null,null,"Tore"]
[null,38]
[1,"WEDEKIN, Franz","TFG 38 Hildesheim I",1973,6,24,null,18,3,3,null,39,":",9,null,176,":",89,null,87,null,6.5,null,29.333333333333332,":",14.833333333333334]
[2,"FINK, Michael","TFG 38 Hildesheim I",1973,6,24,null,18,3,3,null,39,":",9,null,184,":",106,null,78,null,6.5,null,30.666666666666668,":",17.666666666666668]
[3,"KNORR, Peter","TFC Kickers Hamburg I",1973,6,24,null,17,2,5,null,36,":",12,null,196,":",128,null,68,null,6,null,32.666666666666664,":",21.333333333333332]
[4,"MIETKE, Wilfried","Berliner TV 62 I",1973,6,24,null,17,1,6,null,35,":",13,null,149,":",97,null,52,null,5.833333333333333,null,24.833333333333332,":",16.166666666666668]
[5,"MINNICH, Michael","TFG 38 Hildesheim I",1973,6,24,null,15,3,6,null,33,":",15,null,175,":",110,null,65,null,5.5,null,29.166666666666668,":",18.333333333333332]
[6,"MAHNKE, Günter","TFC Kickers Hamburg I",1973,6,24,null,14,4,6,null,32,":",16,null,174,":",130,null,44,null,5.333333333333333,null,29,":",21.666666666666668]
[7,"KOLSKI, Wolfgang","SpVgg. Halbau Berlin I",1973,6,24,null,15,2,7,null,32,":",16,null,144,":",108,null,36,null,5.333333333333333,null,24,":",18]
[8,"SUCHAN, Rainer","SpVgg. Halbau Berlin I",1973,6,24,null,14,4,6,null,32,":",16,null,130,":",100,null,30,null,5.333333333333333,null,21.666666666666668,":",16.666666666666668]
[9,"CONRING, Olaf","TFC Kickers Hamburg I",1973,6,24,null,14,3,7,null,31,":",17,null,146,":",122,null,24,null,5.166666666666667,null,24.333333333333332,":",20.333333333333332]
[10,"GRÜNEBERG, Manfred","TSC Berlin 67 I",1973,6,24,null,14,2,8,null,30,":",18,null,150,":",115,null,35,null,5,null,25,":",19.166666666666668]
[11,"RÖPKE, Jürgen","SpVgg. Halbau Berlin I",1973,6,24,null,13,4,7,null,30,":",18,null,120,":",96,null,24,null,5,null,20,":",16]
[12,"GRÜNEBERG, Klaus-Dieter","TSC Berlin 67 I",1973,6,24,null,12,5,7,null,29,":",19,null,168,":",128,null,40,null,4.833333333333333,null,28,":",21.333333333333332]
[13,"SCHÖNFELD, Horst","TSC Berlin 67 I",1973,5,20,null,13,0,7,null,26,":",14,null,133,":",97,null,36,null,5.2,null,26.6,":",19.399999999999999]
[14,"DIEKERT, Wolfram","SpVgg. Halbau Berlin I",1973,6,24,null,11,4,9,null,26,":",22,null,127,":",129,null,-2,null,4.333333333333333,null,21.166666666666668,":",21.5]
[15,"NISSEN, Thomas","TFC Kickers Hamburg I",1973,6,24,null,11,2,11,null,24,":",24,null,154,":",171,null,-17,null,4,null,25.666666666666668,":",28.5]
[16,"NÖRLING, Karl","Würzburger TKF I",1973,6,24,null,10,1,13,null,21,":",27,null,132,":",156,null,-24,null,3.5,null,22,":",26]
[17,"KLEINSCHMIDT, Gerd","Berliner TV 62 I",1973,6,24,null,8,3,13,null,19,":",29,null,144,":",163,null,-19,null,3.1666666666666665,null,24,":",27.166666666666668]
[18,"KOCH, Hans-Joachim","TFG 38 Hildesheim I",1973,3,12,null,9,0,3,null,18,":",6,null,89,":",55,null,34,null,6,null,29.666666666666668,":",18.333333333333332]
[19,"LEOPOLD, Wolfgang","Berliner TV 62 I",1973,5,20,null,9,0,11,null,18,":",22,null,112,":",124,null,-12,null,3.6,null,22.4,":",24.8]
[20,"PFETSCH, Jochem","TKV 59 Heslach Stuttgart I",1973,6,24,null,8,2,14,null,18,":",30,null,154,":",185,null,-31,null,3,null,25.666666666666668,":",30.833333333333332]
[21,"WÖHR, Hans-Joachim","TKV 59 Heslach Stuttgart I",1973,5,20,null,6,2,12,null,14,":",26,null,110,":",156,null,-46,null,2.8,null,22,":",31.2]
[22,"BECHT, Peter","TKV 59 Heslach Stuttgart I",1973,5,20,null,6,1,13,null,13,":",27,null,101,":",127,null,-26,null,2.6,null,20.2,":",25.4]
[23,"SCHMIßRAUTER, Manfred","TKV 59 Heslach Stuttgart I",1973,5,20,null,6,0,14,null,12,":",28,null,93,":",122,null,-29,null,2.4,null,18.600000000000001,":",24.4]
[24,"REUL, Winfried","Würzburger TKF I",1973,3,12,null,5,1,6,null,11,":",13,null,62,":",60,null,2,null,3.6666666666666665,null,20.666666666666668,":",20]
[25,"JAKOB, Jörg","TSC Berlin 67 I",1973,3,12,null,4,1,7,null,9,":",15,null,67,":",84,null,-17,null,3,null,22.333333333333332,":",28]
[26,"MELISS, Dieter","TSC Berlin 67 I",1973,2,8,null,4,0,4,null,8,":",8,null,48,":",60,null,-12,null,4,null,24,":",30]
[27,"RITTER, Uwe","TFG 38 Hildesheim I",1973,2,8,null,2,2,4,null,6,":",10,null,44,":",44,null,0,null,3,null,22,":",22]
[28,"GRIMM, Walter","Berliner TV 62 I",1973,2,8,null,3,0,5,null,6,":",10,null,39,":",53,null,-14,null,3,null,19.5,":",26.5]
[29,"GUTTMANN, Peter","TSC Berlin 67 I",1973,2,8,null,1,2,5,null,4,":",12,null,29,":",42,null,-13,null,2,null,14.5,":",21]
[30,"BEMERL, Bernd","Würzburger TKF I",1973,3,12,null,2,0,10,null,4,":",20,null,44,":",61,null,-17,null,1.3333333333333333,null,14.666666666666666,":",20.333333333333332]
[31,"FESER, Manfred","Würzburger TKF I",1973,4,16,null,1,2,13,null,4,":",28,null,82,":",142,null,-60,null,1,null,20.5,":",35.5]
[32,"KLAUS, Robert","Würzburger TKF I",1973,4,16,null,2,0,14,null,4,":",28,null,67,":",173,null,-106,null,1,null,16.75,":",43.25]
[33,"STIEHLER, Ralf","TFG 38 Hildesheim I",1973,1,4,null,1,1,2,null,3,":",5,null,20,":",17,null,3,null,3,null,20,":",17]
[34,"KWELLA, Frank","Berliner TV 62 I",1973,3,12,null,1,1,10,null,3,":",21,null,57,":",114,null,-57,null,1,null,19,":",38]
[35,"WAHL, Günther","TKV 59 Heslach Stuttgart I",1973,1,4,null,1,0,3,null,2,":",6,null,19,":",33,null,-14,null,2,null,19,":",33]
[36,"PFEIFFENBERGER, Wolfgang","Würzburger TKF I",1973,4,16,null,0,1,15,null,1,":",31,null,79,":",164,null,-85,null,0.25,null,19.75,":",41]
[37,"MIETKE, Reinhard","Berliner TV 62 I",1973,2,8,null,0,0,8,null,0,":",16,null,23,":",45,null,-22,null,0,null,11.5,":",22.5]
[38,"GAHM, Hartmut","TKV 59 Heslach Stuttgart I",1973,2,8,null,0,0,8,null,0,":",16,null,26,":",61,null,-35,null,0,null,13,":",30.5]

{"sheet":"Einzelstatistik_pro_Mannschaft","index":6,"n_rows":45,"n_cols":26,"rows_kept":45,"cut":false,"hidden":false,"merged":[[1,0,1,25]]}
[]
["EINZELSTATISTIK PRO MANNSCHAFT"]
[]
[null,null,"GESAMT",null,{"$f":"SUBTOTAL(9,E8:E47)","v":168},{"$f":"SUBTOTAL(9,F8:F47)","v":672},null,{"$f":"SUBTOTAL(9,H8:H47)","v":305},{"$f":"SUBTOTAL(9,I8:I47)","v":62},{"$f":"SUBTOTAL(9,J8:J47)","v":305},null,{"$f":"SUBTOTAL(9,L8:L47)","v":672},":",{"$f":"SUBTOTAL(9,N8:N47)","v":672},null,{"$f":"SUBTOTAL(9,P8:P47)","v":3967},":",{"$f":"SUBTOTAL(9,R8:R47)","v":3967},null,{"$f":"SUBTOTAL(9,T8:T47)","v":0},null,null,null,null,"Durchschnitt"]
[]
["Platz",null,"Mannschaft","Saisons","Match","Spiele",null,"S","U","N",null,null,"Punkte",null,null,null,"Tore",null,null,"Diff.",null,"Punkte",null,null,"Tore"]
[null,38]
[1,"WEDEKIN, Franz","TFG 38 Hildesheim I",1,6,24,null,18,3,3,null,39,":",9,null,176,":",89,null,87,null,6.5,null,29.333333333333332,":",14.833333333333334]
[2,"FINK, Michael","TFG 38 Hildesheim I",1,6,24,null,18,3,3,null,39,":",9,null,184,":",106,null,78,null,6.5,null,30.666666666666668,":",17.666666666666668]
[3,"KNORR, Peter","TFC Kickers Hamburg I",1,6,24,null,17,2,5,null,36,":",12,null,196,":",128,null,68,null,6,null,32.666666666666664,":",21.333333333333332]
[4,"MIETKE, Wilfried","Berliner TV 62 I",1,6,24,null,17,1,6,null,35,":",13,null,149,":",97,null,52,null,5.833333333333333,null,24.833333333333332,":",16.166666666666668]
[5,"MINNICH, Michael","TFG 38 Hildesheim I",1,6,24,null,15,3,6,null,33,":",15,null,175,":",110,null,65,null,5.5,null,29.166666666666668,":",18.333333333333332]
[6,"MAHNKE, Günter","TFC Kickers Hamburg I",1,6,24,null,14,4,6,null,32,":",16,null,174,":",130,null,44,null,5.333333333333333,null,29,":",21.666666666666668]
[7,"KOLSKI, Wolfgang","SpVgg. Halbau Berlin I",1,6,24,null,15,2,7,null,32,":",16,null,144,":",108,null,36,null,5.333333333333333,null,24,":",18]
[8,"SUCHAN, Rainer","SpVgg. Halbau Berlin I",1,6,24,null,14,4,6,null,32,":",16,null,130,":",100,null,30,null,5.333333333333333,null,21.666666666666668,":",16.666666666666668]
[9,"CONRING, Olaf","TFC Kickers Hamburg I",1,6,24,null,14,3,7,null,31,":",17,null,146,":",122,null,24,null,5.166666666666667,null,24.333333333333332,":",20.333333333333332]
[10,"GRÜNEBERG, Manfred","TSC Berlin 67 I",1,6,24,null,14,2,8,null,30,":",18,null,150,":",115,null,35,null,5,null,25,":",19.166666666666668]
[11,"RÖPKE, Jürgen","SpVgg. Halbau Berlin I",1,6,24,null,13,4,7,null,30,":",18,null,120,":",96,null,24,null,5,null,20,":",16]
[12,"GRÜNEBERG, Klaus-Dieter","TSC Berlin 67 I",1,6,24,null,12,5,7,null,29,":",19,null,168,":",128,null,40,null,4.833333333333333,null,28,":",21.333333333333332]
[13,"SCHÖNFELD, Horst","TSC Berlin 67 I",1,5,20,null,13,0,7,null,26,":",14,null,133,":",97,null,36,null,5.2,null,26.6,":",19.399999999999999]
[14,"DIEKERT, Wolfram","SpVgg. Halbau Berlin I",1,6,24,null,11,4,9,null,26,":",22,null,127,":",129,null,-2,null,4.333333333333333,null,21.166666666666668,":",21.5]
[15,"NISSEN, Thomas","TFC Kickers Hamburg I",1,6,24,null,11,2,11,null,24,":",24,null,154,":",171,null,-17,null,4,null,25.666666666666668,":",28.5]
[16,"NÖRLING, Karl","Würzburger TKF I",1,6,24,null,10,1,13,null,21,":",27,null,132,":",156,null,-24,null,3.5,null,22,":",26]
[17,"KLEINSCHMIDT, Gerd","Berliner TV 62 I",1,6,24,null,8,3,13,null,19,":",29,null,144,":",163,null,-19,null,3.1666666666666665,null,24,":",27.166666666666668]
[18,"KOCH, Hans-Joachim","TFG 38 Hildesheim I",1,3,12,null,9,0,3,null,18,":",6,null,89,":",55,null,34,null,6,null,29.666666666666668,":",18.333333333333332]
[19,"LEOPOLD, Wolfgang","Berliner TV 62 I",1,5,20,null,9,0,11,null,18,":",22,null,112,":",124,null,-12,null,3.6,null,22.4,":",24.8]
[20,"PFETSCH, Jochem","TKV 59 Heslach Stuttgart I",1,6,24,null,8,2,14,null,18,":",30,null,154,":",185,null,-31,null,3,null,25.666666666666668,":",30.833333333333332]
[21,"WÖHR, Hans-Joachim","TKV 59 Heslach Stuttgart I",1,5,20,null,6,2,12,null,14,":",26,null,110,":",156,null,-46,null,2.8,null,22,":",31.2]
[22,"BECHT, Peter","TKV 59 Heslach Stuttgart I",1,5,20,null,6,1,13,null,13,":",27,null,101,":",127,null,-26,null,2.6,null,20.2,":",25.4]
[23,"SCHMIßRAUTER, Manfred","TKV 59 Heslach Stuttgart I",1,5,20,null,6,0,14,null,12,":",28,null,93,":",122,null,-29,null,2.4,null,18.600000000000001,":",24.4]
[24,"REUL, Winfried","Würzburger TKF I",1,3,12,null,5,1,6,null,11,":",13,null,62,":",60,null,2,null,3.6666666666666665,null,20.666666666666668,":",20]
[25,"JAKOB, Jörg","TSC Berlin 67 I",1,3,12,null,4,1,7,null,9,":",15,null,67,":",84,null,-17,null,3,null,22.333333333333332,":",28]
[26,"MELISS, Dieter","TSC Berlin 67 I",1,2,8,null,4,0,4,null,8,":",8,null,48,":",60,null,-12,null,4,null,24,":",30]
[27,"RITTER, Uwe","TFG 38 Hildesheim I",1,2,8,null,2,2,4,null,6,":",10,null,44,":",44,null,0,null,3,null,22,":",22]
[28,"GRIMM, Walter","Berliner TV 62 I",1,2,8,null,3,0,5,null,6,":",10,null,39,":",53,null,-14,null,3,null,19.5,":",26.5]
[29,"GUTTMANN, Peter","TSC Berlin 67 I",1,2,8,null,1,2,5,null,4,":",12,null,29,":",42,null,-13,null,2,null,14.5,":",21]
[30,"BEMERL, Bernd","Würzburger TKF I",1,3,12,null,2,0,10,null,4,":",20,null,44,":",61,null,-17,null,1.3333333333333333,null,14.666666666666666,":",20.333333333333332]
[31,"FESER, Manfred","Würzburger TKF I",1,4,16,null,1,2,13,null,4,":",28,null,82,":",142,null,-60,null,1,null,20.5,":",35.5]
[32,"KLAUS, Robert","Würzburger TKF I",1,4,16,null,2,0,14,null,4,":",28,null,67,":",173,null,-106,null,1,null,16.75,":",43.25]
[33,"STIEHLER, Ralf","TFG 38 Hildesheim I",1,1,4,null,1,1,2,null,3,":",5,null,20,":",17,null,3,null,3,null,20,":",17]
[34,"KWELLA, Frank","Berliner TV 62 I",1,3,12,null,1,1,10,null,3,":",21,null,57,":",114,null,-57,null,1,null,19,":",38]
[35,"WAHL, Günther","TKV 59 Heslach Stuttgart I",1,1,4,null,1,0,3,null,2,":",6,null,19,":",33,null,-14,null,2,null,19,":",33]
[36,"PFEIFFENBERGER, Wolfgang","Würzburger TKF I",1,4,16,null,0,1,15,null,1,":",31,null,79,":",164,null,-85,null,0.25,null,19.75,":",41]
[37,"MIETKE, Reinhard","Berliner TV 62 I",1,2,8,null,0,0,8,null,0,":",16,null,23,":",45,null,-22,null,0,null,11.5,":",22.5]
[38,"GAHM, Hartmut","TKV 59 Heslach Stuttgart I",1,2,8,null,0,0,8,null,0,":",16,null,26,":",61,null,-35,null,0,null,13,":",30.5]

{"sheet":"Einzelstatistik_Gesamt","index":7,"n_rows":45,"n_cols":26,"rows_kept":45,"cut":false,"hidden":false,"merged":[[1,0,1,25]]}
[]
["EINZELSTATISTIK GESAMT"]
[]
[null,"GESAMT",null,null,{"$f":"SUM(E8:E53)","v":168},{"$f":"SUM(F8:F53)","v":672},null,{"$f":"SUM(H8:H53)","v":305},{"$f":"SUM(I8:I53)","v":62},{"$f":"SUM(J8:J53)","v":305},null,{"$f":"SUM(L8:L53)","v":672},":",{"$f":"SUM(N8:N53)","v":672},null,{"$f":"SUM(P8:P53)","v":3967},":",{"$f":"SUM(R8:R53)","v":3967},null,{"$f":"SUM(T8:T53)","v":0},null,null,null,null,"Durchschnitt"]
[]
["Platz",null,null,"Saison","Match","Spiele",null,"S","U","N",null,null,"Punkte",null,null,null,"Tore",null,null,"Diff.",null,"Punkte",null,null,"Tore"]
[null,38]
[1,"WEDEKIN, Franz",null,1,6,24,null,18,3,3,null,39,":",9,null,176,":",89,null,87,null,6.5,null,29.333333333333332,":",14.833333333333334]
[2,"FINK, Michael",null,1,6,24,null,18,3,3,null,39,":",9,null,184,":",106,null,78,null,6.5,null,30.666666666666668,":",17.666666666666668]
[3,"KNORR, Peter",null,1,6,24,null,17,2,5,null,36,":",12,null,196,":",128,null,68,null,6,null,32.666666666666664,":",21.333333333333332]
[4,"MIETKE, Wilfried",null,1,6,24,null,17,1,6,null,35,":",13,null,149,":",97,null,52,null,5.833333333333333,null,24.833333333333332,":",16.166666666666668]
[5,"MINNICH, Michael",null,1,6,24,null,15,3,6,null,33,":",15,null,175,":",110,null,65,null,5.5,null,29.166666666666668,":",18.333333333333332]
[6,"MAHNKE, Günter",null,1,6,24,null,14,4,6,null,32,":",16,null,174,":",130,null,44,null,5.333333333333333,null,29,":",21.666666666666668]
[7,"KOLSKI, Wolfgang",null,1,6,24,null,15,2,7,null,32,":",16,null,144,":",108,null,36,null,5.333333333333333,null,24,":",18]
[8,"SUCHAN, Rainer",null,1,6,24,null,14,4,6,null,32,":",16,null,130,":",100,null,30,null,5.333333333333333,null,21.666666666666668,":",16.666666666666668]
[9,"CONRING, Olaf",null,1,6,24,null,14,3,7,null,31,":",17,null,146,":",122,null,24,null,5.166666666666667,null,24.333333333333332,":",20.333333333333332]
[10,"GRÜNEBERG, Manfred",null,1,6,24,null,14,2,8,null,30,":",18,null,150,":",115,null,35,null,5,null,25,":",19.166666666666668]
[11,"RÖPKE, Jürgen",null,1,6,24,null,13,4,7,null,30,":",18,null,120,":",96,null,24,null,5,null,20,":",16]
[12,"GRÜNEBERG, Klaus-Dieter",null,1,6,24,null,12,5,7,null,29,":",19,null,168,":",128,null,40,null,4.833333333333333,null,28,":",21.333333333333332]
[13,"SCHÖNFELD, Horst",null,1,5,20,null,13,0,7,null,26,":",14,null,133,":",97,null,36,null,5.2,null,26.6,":",19.399999999999999]
[14,"DIEKERT, Wolfram",null,1,6,24,null,11,4,9,null,26,":",22,null,127,":",129,null,-2,null,4.333333333333333,null,21.166666666666668,":",21.5]
[15,"NISSEN, Thomas",null,1,6,24,null,11,2,11,null,24,":",24,null,154,":",171,null,-17,null,4,null,25.666666666666668,":",28.5]
[16,"NÖRLING, Karl",null,1,6,24,null,10,1,13,null,21,":",27,null,132,":",156,null,-24,null,3.5,null,22,":",26]
[17,"KLEINSCHMIDT, Gerd",null,1,6,24,null,8,3,13,null,19,":",29,null,144,":",163,null,-19,null,3.1666666666666665,null,24,":",27.166666666666668]
[18,"KOCH, Hans-Joachim",null,1,3,12,null,9,0,3,null,18,":",6,null,89,":",55,null,34,null,6,null,29.666666666666668,":",18.333333333333332]
[19,"LEOPOLD, Wolfgang",null,1,5,20,null,9,0,11,null,18,":",22,null,112,":",124,null,-12,null,3.6,null,22.4,":",24.8]
[20,"PFETSCH, Jochem",null,1,6,24,null,8,2,14,null,18,":",30,null,154,":",185,null,-31,null,3,null,25.666666666666668,":",30.833333333333332]
[21,"WÖHR, Hans-Joachim",null,1,5,20,null,6,2,12,null,14,":",26,null,110,":",156,null,-46,null,2.8,null,22,":",31.2]
[22,"BECHT, Peter",null,1,5,20,null,6,1,13,null,13,":",27,null,101,":",127,null,-26,null,2.6,null,20.2,":",25.4]
[23,"SCHMIßRAUTER, Manfred",null,1,5,20,null,6,0,14,null,12,":",28,null,93,":",122,null,-29,null,2.4,null,18.600000000000001,":",24.4]
[24,"REUL, Winfried",null,1,3,12,null,5,1,6,null,11,":",13,null,62,":",60,null,2,null,3.6666666666666665,null,20.666666666666668,":",20]
[25,"JAKOB, Jörg",null,1,3,12,null,4,1,7,null,9,":",15,null,67,":",84,null,-17,null,3,null,22.333333333333332,":",28]
[26,"MELISS, Dieter",null,1,2,8,null,4,0,4,null,8,":",8,null,48,":",60,null,-12,null,4,null,24,":",30]
[27,"RITTER, Uwe",null,1,2,8,null,2,2,4,null,6,":",10,null,44,":",44,null,0,null,3,null,22,":",22]
[28,"GRIMM, Walter",null,1,2,8,null,3,0,5,null,6,":",10,null,39,":",53,null,-14,null,3,null,19.5,":",26.5]
[29,"GUTTMANN, Peter",null,1,2,8,null,1,2,5,null,4,":",12,null,29,":",42,null,-13,null,2,null,14.5,":",21]
[30,"BEMERL, Bernd",null,1,3,12,null,2,0,10,null,4,":",20,null,44,":",61,null,-17,null,1.3333333333333333,null,14.666666666666666,":",20.333333333333332]
[31,"FESER, Manfred",null,1,4,16,null,1,2,13,null,4,":",28,null,82,":",142,null,-60,null,1,null,20.5,":",35.5]
[32,"KLAUS, Robert",null,1,4,16,null,2,0,14,null,4,":",28,null,67,":",173,null,-106,null,1,null,16.75,":",43.25]
[33,"STIEHLER, Ralf",null,1,1,4,null,1,1,2,null,3,":",5,null,20,":",17,null,3,null,3,null,20,":",17]
[34,"KWELLA, Frank",null,1,3,12,null,1,1,10,null,3,":",21,null,57,":",114,null,-57,null,1,null,19,":",38]
[35,"WAHL, Günther",null,1,1,4,null,1,0,3,null,2,":",6,null,19,":",33,null,-14,null,2,null,19,":",33]
[36,"PFEIFFENBERGER, Wolfgang",null,1,4,16,null,0,1,15,null,1,":",31,null,79,":",164,null,-85,null,0.25,null,19.75,":",41]
[37,"MIETKE, Reinhard",null,1,2,8,null,0,0,8,null,0,":",16,null,23,":",45,null,-22,null,0,null,11.5,":",22.5]
[38,"GAHM, Hartmut",null,1,2,8,null,0,0,8,null,0,":",16,null,26,":",61,null,-35,null,0,null,13,":",30.5]

{"sheet":"Spielprotokoll","index":8,"n_rows":35,"n_cols":48,"rows_kept":35,"cut":false,"hidden":false,"merged":[[4,24,4,34],[8,24,8,34],[24,16,24,27],[20,30,20,31],[22,30,22,31],[21,33,21,34],[21,30,21,31],[0,21,0,24],[25,30,25,31],[25,33,25,34],[23,30,23,31],[24,30,24,31],[23,33,23,34],[24,33,24,34],[16,30,16,31],[17,30,17,31],[18,30,18,31],[4,5,4,15],[19,16,19,27],[14,30,14,31],[15,30,15,31],[10,3,10,13],[10,16,10,27],[19,3,19,13],[7,24,7,34],[5,24,5,34],[5,5,5,15],[12,30,12,31],[13,16,13,27],[13,3,13,13],[18,16,18,27],[18,33,18,34],[19,30,19,31],[13,30,13,31],[14,16,14,27],[6,5,6,15],[14,3,14,13],[11,30,11,31],[17,33,17,34],[13,33,13,34],[18,3,18,13],[34,44,34,45],[34,47,34,48],[31,42,31,43],[31,33,31,35],[30,39,30,40],[31,39,31,40],[33,39,33,40],[33,42,33,43],[30,33,30,35],[33,33,33,35],[34,15,34,17],[34,19,34,21],[29,19,29,21],[30,15,30,17],[30,19,30,21],[30,29,30,31],[28,39,28,40],[29,39,29,40],[28,42,28,43],[29,42,29,43],[30,42,30,43],[34,2,34,7],[33,8,33,10],[33,2,33,7],[31,3,31,7],[29,22,29,24],[34,29,34,31],[34,33,34,35],[29,3,29,7],[34,8,34,10],[34,12,34,14],[33,12,33,14],[34,22,34,24],[31,15,31,17],[31,19,31,21],[31,29,31,31],[34,26,34,28],[30,22,30,24],[30,26,30,28],[31,22,31,24],[31,26,31,28],[33,29,33,31],[29,29,29,31],[29,33,29,35],[33,22,33,24],[0,39,0,41],[0,42,0,47],[2,34,2,35],[2,39,2,40],[2,43,2,44],[2,46,2,47],[33,15,33,17],[33,19,33,21],[31,12,31,14],[33,26,33,28],[28,44,28,45],[28,47,28,48],[29,44,29,45],[29,47,29,48],[30,44,30,45],[30,47,30,48],[31,44,31,45],[31,47,31,48],[1,9,1,29],[2,2,2,14],[10,30,10,31],[16,3,16,13],[2,16,2,32],[11,16,11,27],[27,44,27,48],[27,16,27,21],[30,3,30,7],[27,9,27,14],[30,8,30,10],[28,8,28,10],[29,8,29,10],[28,15,28,17],[30,12,30,14],[29,26,29,28],[28,22,28,24],[27,39,27,43],[28,33,28,35],[28,29,28,31],[27,30,27,35],[31,8,31,10],[29,15,29,17],[29,12,29,14],[25,3,25,13],[28,3,28,7],[28,12,28,14],[28,19,28,21],[25,16,25,27],[21,16,21,27],[22,16,22,27],[23,16,23,27],[24,3,24,13],[28,26,28,28],[21,3,21,13],[27,23,27,28],[23,3,23,13],[17,3,17,13],[15,3,15,13],[20,3,20,13],[6,24,6,34],[12,3,12,13],[11,3,11,13],[8,5,8,15],[7,5,7,15],[22,33,22,34],[20,16,20,27],[17,16,17,27],[15,16,15,27],[22,3,22,13],[15,33,15,34],[16,33,16,34],[14,33,14,34],[12,16,12,27],[10,33,10,34],[11,33,11,34],[12,33,12,34],[16,16,16,27],[20,33,20,34],[19,33,19,34]]}
[null,null,null,null,null,null,null,null,null,null,null,null,null,"Protokollnummer:",null,null,null,null,null,null,null,21,null,null,null,null,null,null,null,null,null,null,null,null,null,null,null,null,null,"Datum:",null,null,"1973-08-19"]
[null,null,"Liga/Pokal/Turnier:",null,null,null,null,null,null,1973]
[null,null,"TFG 38 Hildesheim I",null,null,null,null,null,null,null,null,null,null,null,null,"-","TFC Kickers Hamburg I",null,null,null,null,null,null,null,null,null,null,null,null,null,null,null,null,null,{"$f":"AN34","v":24},null,":",null,null,{"$f":"AQ34","v":8},null,null,null,{"$f":"AS35","v":123},null,":",{"$f":"AV35","v":72}]
[]
[null,null,null,null,null,"Gastgeber",null,null,null,null,null,null,null,null,null,null,null,null,null,null,null,null,null,null,"Gäste"]
[null,null,null,null,1,"FINK, Michael",null,null,null,null,null,null,null,null,null,null,null,null,null,null,null,null,null,5,"KNORR, Peter"]
[null,null,null,null,2,"KOCH, Hans-Joachim",null,null,null,null,null,null,null,null,null,null,null,null,null,null,null,null,null,6,"NISSEN, Thomas"]
[null,null,null,null,3,"WEDEKIN, Franz",null,null,null,null,null,null,null,null,null,null,null,null,null,null,null,null,null,7,"CONRING, Olaf"]
[null,null,null,null,4,"MINNICH, Michael",null,null,null,null,null,null,null,null,null,null,null,null,null,null,null,null,null,8,"MAHNKE, Günter"]
[]
[null,null,1,{"$f":"IF(ISBLANK($F$6),\"\",$F$6)","v":"FINK, Michael"},null,null,null,null,null,null,null,null,null,null,"-",5,{"$f":"IF(ISBLANK($Y$6),\"\",$Y$6)","v":"KNORR, Peter"},null,null,null,null,null,null,null,null,null,null,null,null,null,9,null,":",2,null,null,null,{"$f":"IF(ISNUMBER(AH11),IF(AE11>AH11,2,IF(AE11=AH11,1,0)),\"\")","v":2},{"$f":"IF(ISNUMBER(AH11),IF(AH11>AE11,2,IF(AE11=AH11,1,0)),\"\")","v":0},null,3]
[null,null,2,{"$f":"IF(ISBLANK($F$7),\"\",$F$7)","v":"KOCH, Hans-Joachim"},null,null,null,null,null,null,null,null,null,null,"-",6,{"$f":"IF(ISBLANK($Y$7),\"\",$Y$7)","v":"NISSEN, Thomas"},null,null,null,null,null,null,null,null,null,null,null,null,null,9,null,":",4,null,null,null,2,0,null,7,null,{"$f":"IF(ISNUMBER(AH12),SUM($AL$11:AL12),\"\")","v":4},{"$f":"IF(ISNUMBER(AH12),\":\",\"\")","v":":"},{"$f":"IF(ISNUMBER(AH12),SUM($AM$11:AM12),\"\")","v":0},{"$f":"IF(ISNUMBER(AH12),SUM($AE$11:AF12),\"\")","v":18},{"$f":"IF(ISNUMBER(AH12),\":\",\"\")","v":":"},{"$f":"IF(ISNUMBER(AH12),SUM($AH$11:AI12),\"\")","v":6}]
[null,null,3,{"$f":"IF(ISBLANK($F$8),\"\",$F$8)","v":"WEDEKIN, Franz"},null,null,null,null,null,null,null,null,null,null,"-",7,{"$f":"IF(ISBLANK($Y$8),\"\",$Y$8)","v":"CONRING, Olaf"},null,null,null,null,null,null,null,null,null,null,null,null,null,4,null,":",5,null,null,null,0,2,null,1]
[null,null,4,{"$f":"IF(ISBLANK($F$9),\"\",$F$9)","v":"MINNICH, Michael"},null,null,null,null,null,null,null,null,null,null,"-",8,{"$f":"IF(ISBLANK($Y$9),\"\",$Y$9)","v":"MAHNKE, Günter"},null,null,null,null,null,null,null,null,null,null,null,null,null,7,null,":",3,null,null,null,2,0,null,6,null,{"$f":"IF(ISNUMBER(AH14),SUM($AL$11:AL14),\"\")","v":6},{"$f":"IF(ISNUMBER(AH14),\":\",\"\")","v":":"},{"$f":"IF(ISNUMBER(AH14),SUM($AM$11:AM14),\"\")","v":2},{"$f":"IF(ISNUMBER(AH14),SUM($AE$11:AF14),\"\")","v":29},{"$f":"IF(ISNUMBER(AH14),\":\",\"\")","v":":"},{"$f":"IF(ISNUMBER(AH14),SUM($AH$11:AI14),\"\")","v":14}]
[null,null,2,{"$f":"IF(ISBLANK($F$7),\"\",$F$7)","v":"KOCH, Hans-Joachim"},null,null,null,null,null,null,null,null,null,null,"-",5,{"$f":"IF(ISBLANK($Y$6),\"\",$Y$6)","v":"KNORR, Peter"},null,null,null,null,null,null,null,null,null,null,null,null,null,6,null,":",4,null,null,null,2,0,null,4]
[null,null,3,{"$f":"IF(ISBLANK($F$8),\"\",$F$8)","v":"WEDEKIN, Franz"},null,null,null,null,null,null,null,null,null,null,"-",6,{"$f":"IF(ISBLANK($Y$7),\"\",$Y$7)","v":"NISSEN, Thomas"},null,null,null,null,null,null,null,null,null,null,null,null,null,9,null,":",6,null,null,null,2,0,null,8,null,{"$f":"IF(ISNUMBER(AH16),SUM($AL$11:AL16),\"\")","v":10},{"$f":"IF(ISNUMBER(AH16),\":\",\"\")","v":":"},{"$f":"IF(ISNUMBER(AH16),SUM($AM$11:AM16),\"\")","v":2},{"$f":"IF(ISNUMBER(AH16),SUM($AE$11:AF16),\"\")","v":44},{"$f":"IF(ISNUMBER(AH16),\":\",\"\")","v":":"},{"$f":"IF(ISNUMBER(AH16),SUM($AH$11:AI16),\"\")","v":24}]
[null,null,4,{"$f":"IF(ISBLANK($F$9),\"\",$F$9)","v":"MINNICH, Michael"},null,null,null,null,null,null,null,null,null,null,"-",7,{"$f":"IF(ISBLANK($Y$8),\"\",$Y$8)","v":"CONRING, Olaf"},null,null,null,null,null,null,null,null,null,null,null,null,null,4,null,":",7,null,null,null,0,2,null,2]
[null,null,1,{"$f":"IF(ISBLANK($F$6),\"\",$F$6)","v":"FINK, Michael"},null,null,null,null,null,null,null,null,null,null,"-",8,{"$f":"IF(ISBLANK($Y$9),\"\",$Y$9)","v":"MAHNKE, Günter"},null,null,null,null,null,null,null,null,null,null,null,null,null,9,null,":",6,null,null,null,2,0,null,5,null,{"$f":"IF(ISNUMBER(AH18),SUM($AL$11:AL18),\"\")","v":12},{"$f":"IF(ISNUMBER(AH18),\":\",\"\")","v":":"},{"$f":"IF(ISNUMBER(AH18),SUM($AM$11:AM18),\"\")","v":4},{"$f":"IF(ISNUMBER(AH18),SUM($AE$11:AF18),\"\")","v":57},{"$f":"IF(ISNUMBER(AH18),\":\",\"\")","v":":"},{"$f":"IF(ISNUMBER(AH18),SUM($AH$11:AI18),\"\")","v":37}]
[null,null,4,{"$f":"IF(ISBLANK($F$9),\"\",$F$9)","v":"MINNICH, Michael"},null,null,null,null,null,null,null,null,null,null,"-",6,{"$f":"IF(ISBLANK($Y$7),\"\",$Y$7)","v":"NISSEN, Thomas"},null,null,null,null,null,null,null,null,null,null,null,null,null,10,null,":",2,null,null,null,2,0,null,1]
[null,null,3,{"$f":"IF(ISBLANK($F$8),\"\",$F$8)","v":"WEDEKIN, Franz"},null,null,null,null,null,null,null,null,null,null,"-",5,{"$f":"IF(ISBLANK($Y$6),\"\",$Y$6)","v":"KNORR, Peter"},null,null,null,null,null,null,null,null,null,null,null,null,null,10,null,":",6,null,null,null,2,0,null,7,null,{"$f":"IF(ISNUMBER(AH20),SUM($AL$11:AL20),\"\")","v":16},{"$f":"IF(ISNUMBER(AH20),\":\",\"\")","v":":"},{"$f":"IF(ISNUMBER(AH20),SUM($AM$11:AM20),\"\")","v":4},{"$f":"IF(ISNUMBER(AH20),SUM($AE$11:AF20),\"\")","v":77},{"$f":"IF(ISNUMBER(AH20),\":\",\"\")","v":":"},{"$f":"IF(ISNUMBER(AH20),SUM($AH$11:AI20),\"\")","v":45}]
[null,null,2,{"$f":"IF(ISBLANK($F$7),\"\",$F$7)","v":"KOCH, Hans-Joachim"},null,null,null,null,null,null,null,null,null,null,"-",8,{"$f":"IF(ISBLANK($Y$9),\"\",$Y$9)","v":"MAHNKE, Günter"},null,null,null,null,null,null,null,null,null,null,null,null,null,8,null,":",5,null,null,null,2,0,null,3]
[null,null,1,{"$f":"IF(ISBLANK($F$6),\"\",$F$6)","v":"FINK, Michael"},null,null,null,null,null,null,null,null,null,null,"-",7,{"$f":"IF(ISBLANK($Y$8),\"\",$Y$8)","v":"CONRING, Olaf"},null,null,null,null,null,null,null,null,null,null,null,null,null,6,null,":",4,null,null,null,2,0,null,6,null,{"$f":"IF(ISNUMBER(AH22),SUM($AL$11:AL22),\"\")","v":20},{"$f":"IF(ISNUMBER(AH22),\":\",\"\")","v":":"},{"$f":"IF(ISNUMBER(AH22),SUM($AM$11:AM22),\"\")","v":4},{"$f":"IF(ISNUMBER(AH22),SUM($AE$11:AF22),\"\")","v":91},{"$f":"IF(ISNUMBER(AH22),\":\",\"\")","v":":"},{"$f":"IF(ISNUMBER(AH22),SUM($AH$11:AI22),\"\")","v":54}]
[null,null,1,{"$f":"IF(ISBLANK($F$6),\"\",$F$6)","v":"FINK, Michael"},null,null,null,null,null,null,null,null,null,null,"-",6,{"$f":"IF(ISBLANK($Y$7),\"\",$Y$7)","v":"NISSEN, Thomas"},null,null,null,null,null,null,null,null,null,null,null,null,null,16,null,":",5,null,null,null,2,0,null,2]
[null,null,4,{"$f":"IF(ISBLANK($F$9),\"\",$F$9)","v":"MINNICH, Michael"},null,null,null,null,null,null,null,null,null,null,"-",5,{"$f":"IF(ISBLANK($Y$6),\"\",$Y$6)","v":"KNORR, Peter"},null,null,null,null,null,null,null,null,null,null,null,null,null,5,null,":",8,null,null,null,0,2,null,8,null,{"$f":"IF(ISNUMBER(AH24),SUM($AL$11:AL24),\"\")","v":22},{"$f":"IF(ISNUMBER(AH24),\":\",\"\")","v":":"},{"$f":"IF(ISNUMBER(AH24),SUM($AM$11:AM24),\"\")","v":6},{"$f":"IF(ISNUMBER(AH24),SUM($AE$11:AF24),\"\")","v":112},{"$f":"IF(ISNUMBER(AH24),\":\",\"\")","v":":"},{"$f":"IF(ISNUMBER(AH24),SUM($AH$11:AI24),\"\")","v":67}]
[null,null,3,{"$f":"IF(ISBLANK($F$8),\"\",$F$8)","v":"WEDEKIN, Franz"},null,null,null,null,null,null,null,null,null,null,"-",8,{"$f":"IF(ISBLANK($Y$9),\"\",$Y$9)","v":"MAHNKE, Günter"},null,null,null,null,null,null,null,null,null,null,null,null,null,8,null,":",1,null,null,null,2,0,null,4]
[null,null,2,{"$f":"IF(ISBLANK($F$7),\"\",$F$7)","v":"KOCH, Hans-Joachim"},null,null,null,null,null,null,null,null,null,null,"-",7,{"$f":"IF(ISBLANK($Y$8),\"\",$Y$8)","v":"CONRING, Olaf"},null,null,null,null,null,null,null,null,null,null,null,null,null,3,null,":",4,null,null,null,0,2,null,5,null,{"$f":"IF(ISNUMBER(AH26),SUM($AL$11:AL26),\"\")","v":24},{"$f":"IF(ISNUMBER(AH26),\":\",\"\")","v":":"},{"$f":"IF(ISNUMBER(AH26),SUM($AM$11:AM26),\"\")","v":8},{"$f":"IF(ISNUMBER(AH26),SUM($AE$11:AF26),\"\")","v":123},{"$f":"IF(ISNUMBER(AH26),\":\",\"\")","v":":"},{"$f":"IF(ISNUMBER(AH26),SUM($AH$11:AI26),\"\")","v":72}]
[]
[null,null,null,null,null,null,null,null,5,{"$f":"IF(ISBLANK($Y$6),\"\",$Y$6)","v":"KNORR, Peter"},null,null,null,null,null,6,{"$f":"IF(ISBLANK($Y$7),\"\",$Y$7)","v":"NISSEN, Thomas"},null,null,null,null,null,7,{"$f":"IF(ISBLANK($Y$8),\"\",$Y$8)","v":"CONRING, Olaf"},null,null,null,null,null,8,{"$f":"IF(ISBLANK($Y$9),\"\",$Y$9)","v":"MAHNKE, Günter"},null,null,null,null,null,null,null,null,"Punkte",null,null,null,null,"Tore"]
[null,null,1,{"$f":"IF(ISBLANK($F$6),\"\",$F$6)","v":"FINK, Michael"},null,null,null,null,{"$f":"IF(ISNUMBER(AE11),AE11,\"\")","v":9},null,null,":",{"$f":"IF(ISNUMBER(AH11),AH11,\"\")","v":2},null,null,{"$f":"IF(ISNUMBER(AE23),AE23,\"\")","v":16},null,null,":",{"$f":"IF(ISNUMBER(AH23),AH23,\"\")","v":5},null,null,{"$f":"IF(ISNUMBER(AE22),AE22,\"\")","v":6},null,null,":",{"$f":"IF(ISNUMBER(AH22),AH22,\"\")","v":4},null,null,{"$f":"IF(ISNUMBER(AE18),AE18,\"\")","v":9},null,null,":",{"$f":"IF(ISNUMBER(AH18),AH18,\"\")","v":6},null,null,null,null,null,{"$f":"IF(ISBLANK(F6),\"\",IF(ISNUMBER(AH11),SUMIF(D11:N26,D29,AL11:AL26),\"\"))","v":8},null,":",{"$f":"IF(ISBLANK(F6),\"\",IF(ISNUMBER(AH11),SUMIF(D11:N26,D29,AM11:AM26),\"\"))","v":0},null,{"$f":"IF(ISBLANK(F6),\"\",IF(ISNUMBER(AH11),SUM(I29,P29,W29,AD29),\"\"))","v":40},null,":",{"$f":"IF(ISBLANK(F6),\"\",IF(ISNUMBER(AH11),SUM(M29,T29,AA29,AH29),\"\"))","v":17}]
[null,null,2,{"$f":"IF(ISBLANK($F$7),\"\",$F$7)","v":"KOCH, Hans-Joachim"},null,null,null,null,{"$f":"IF(ISNUMBER(AE15),AE15,\"\")","v":6},null,null,":",{"$f":"IF(ISNUMBER(AH15),AH15,\"\")","v":4},null,null,{"$f":"IF(ISNUMBER(AE12),AE12,\"\")","v":9},null,null,":",{"$f":"IF(ISNUMBER(AH12),AH12,\"\")","v":4},null,null,{"$f":"IF(ISNUMBER(AE26),AE26,\"\")","v":3},null,null,":",{"$f":"IF(ISNUMBER(AH26),AH26,\"\")","v":4},null,null,{"$f":"IF(ISNUMBER(AE21),AE21,\"\")","v":8},null,null,":",{"$f":"IF(ISNUMBER(AH21),AH21,\"\")","v":5},null,null,null,null,null,{"$f":"IF(ISBLANK(F7),\"\",IF(ISNUMBER(AH12),SUMIF(D12:N27,D30,AL12:AL27),\"\"))","v":6},null,":",{"$f":"IF(ISBLANK(F7),\"\",IF(ISNUMBER(AH12),SUMIF(D12:N27,D30,AM12:AM27),\"\"))","v":2},null,{"$f":"IF(ISBLANK(F7),\"\",IF(ISNUMBER(AH12),SUM(I30,P30,W30,AD30),\"\"))","v":26},null,":",{"$f":"IF(ISBLANK(F7),\"\",IF(ISNUMBER(AH12),SUM(M30,T30,AA30,AH30),\"\"))","v":17}]
[null,null,3,{"$f":"IF(ISBLANK($F$8),\"\",$F$8)","v":"WEDEKIN, Franz"},null,null,null,null,{"$f":"IF(ISNUMBER(AE20),AE20,\"\")","v":10},null,null,":",{"$f":"IF(ISNUMBER(AH20),AH20,\"\")","v":6},null,null,{"$f":"IF(ISNUMBER(AE16),AE16,\"\")","v":9},null,null,":",{"$f":"IF(ISNUMBER(AH16),AH16,\"\")","v":6},null,null,{"$f":"IF(ISNUMBER(AE13),AE13,\"\")","v":4},null,null,":",{"$f":"IF(ISNUMBER(AH13),AH13,\"\")","v":5},null,null,{"$f":"IF(ISNUMBER(AE25),AE25,\"\")","v":8},null,null,":",{"$f":"IF(ISNUMBER(AH25),AH25,\"\")","v":1},null,null,null,null,null,{"$f":"IF(ISBLANK(F8),\"\",IF(ISNUMBER(AH13),SUMIF(D13:N28,D31,AL13:AL28),\"\"))","v":6},null,":",{"$f":"IF(ISBLANK(F8),\"\",IF(ISNUMBER(AH13),SUMIF(D13:N28,D31,AM13:AM28),\"\"))","v":2},null,{"$f":"IF(ISBLANK(F8),\"\",IF(ISNUMBER(AH13),SUM(I31,P31,W31,AD31),\"\"))","v":31},null,":",{"$f":"IF(ISBLANK(F8),\"\",IF(ISNUMBER(AH13),SUM(M31,T31,AA31,AH31),\"\"))","v":18}]
[null,null,4,{"$f":"IF(ISBLANK($F$9),\"\",$F$9)","v":"MINNICH, Michael"},null,null,null,null,{"$f":"IF(ISNUMBER(AE24),AE24,\"\")","v":5},null,null,":",{"$f":"IF(ISNUMBER(AH24),AH24,\"\")","v":8},null,null,{"$f":"IF(ISNUMBER(AE19),AE19,\"\")","v":10},null,null,":",{"$f":"IF(ISNUMBER(AH19),AH19,\"\")","v":2},null,null,{"$f":"IF(ISNUMBER(AE17),AE17,\"\")","v":4},null,null,":",{"$f":"IF(ISNUMBER(AH17),AH17,\"\")","v":7},null,null,{"$f":"IF(ISNUMBER(AE14),AE14,\"\")","v":7},null,null,":",{"$f":"IF(ISNUMBER(AH14),AH14,\"\")","v":3},null,null,null,null,null,{"$f":"IF(ISBLANK(F9),\"\",IF(ISNUMBER(AH14),SUMIF(D14:N29,D32,AL14:AL29),\"\"))","v":4},null,":",{"$f":"IF(ISBLANK(F9),\"\",IF(ISNUMBER(AH14),SUMIF(D14:N29,D32,AM14:AM29),\"\"))","v":4},null,{"$f":"IF(ISBLANK(F9),\"\",IF(ISNUMBER(AH14),SUM(I32,P32,W32,AD32),\"\"))","v":26},null,":",{"$f":"IF(ISBLANK(F9),\"\",IF(ISNUMBER(AH14),SUM(M32,T32,AA32,AH32),\"\"))","v":20}]
[]
[null,null,"Punkte",null,null,null,null,null,{"$f":"IF(ISBLANK(Y6),\"\",IF(ISNUMBER(AH11),SUMIF($Q$11:$AB$26,J28,$AM$11:$AM$26),\"\"))","v":2},null,null,":",{"$f":"IF(ISBLANK(Y6),\"\",IF(ISNUMBER(AH11),SUMIF($Q$11:$AB$26,J28,$AL$11:$AL$26),\"\"))","v":6},null,null,{"$f":"IF(ISBLANK(Y7),\"\",IF(ISNUMBER(AH12),SUMIF($Q$11:$AB$26,Q28,$AM$11:$AM$26),\"\"))","v":0},null,null,":",{"$f":"IF(ISBLANK(Y7),\"\",IF(ISNUMBER(AH12),SUMIF($Q$11:$AB$26,Q28,$AL$11:$AL$26),\"\"))","v":8},null,null,{"$f":"IF(ISBLANK(Y8),\"\",IF(ISNUMBER(AH13),SUMIF($Q$11:$AB$26,X28,$AM$11:$AM$26),\"\"))","v":6},null,null,":",{"$f":"IF(ISBLANK(Y8),\"\",IF(ISNUMBER(AH13),SUMIF($Q$11:$AB$26,X28,$AL$11:$AL$26),\"\"))","v":2},null,null,{"$f":"IF(ISBLANK(Y9),\"\",IF(ISNUMBER(AH14),SUMIF($Q$11:$AB$26,AE28,$AM$11:$AM$26),\"\"))","v":0},null,null,":",{"$f":"IF(ISBLANK(Y9),\"\",IF(ISNUMBER(AH14),SUMIF($Q$11:$AB$26,AE28,$AL$11:$AL$26),\"\"))","v":8},null,null,null,null,null,{"$f":"IF(ISNUMBER(AH11),SUM(AN29:AO32),\"\")","v":24},null,":",{"$f":"IF(ISNUMBER(AH11),SUM(AQ29:AR32),\"\")","v":8}]
[null,null,"Tore",null,null,null,null,null,{"$f":"IF(ISBLANK(Y6),\"\",IF(ISNUMBER(AH11),SUM(M29:M32),\"\"))","v":20},null,null,":",{"$f":"IF(ISBLANK(Y6),\"\",IF(ISNUMBER(AH11),SUM(I29:I32),\"\"))","v":30},null,null,{"$f":"IF(ISBLANK(Y7),\"\",IF(ISNUMBER(AH12),SUM(T29:T32),\"\"))","v":17},null,null,":",{"$f":"IF(ISBLANK(Y7),\"\",IF(ISNUMBER(AH12),SUM(P29:P32),\"\"))","v":44},null,null,{"$f":"IF(ISBLANK(Y8),\"\",IF(ISNUMBER(AH13),SUM(AA29:AA32),\"\"))","v":20},null,null,":",{"$f":"IF(ISBLANK(Y8),\"\",IF(ISNUMBER(AH13),SUM(W29:W32),\"\"))","v":17},null,null,{"$f":"IF(ISBLANK(Y9),\"\",IF(ISNUMBER(AH14),SUM(AH29:AH32),\"\"))","v":15},null,null,":",{"$f":"IF(ISBLANK(Y9),\"\",IF(ISNUMBER(AH14),SUM(AD29:AD32),\"\"))","v":32},null,null,null,null,null,null,null,null,null,null,{"$f":"IF(ISNUMBER(AH11),SUM(AS29:AT32),\"\")","v":123},null,":",{"$f":"IF(ISNUMBER(AH11),SUM(AV29:AW32),\"\")","v":72}]

{"sheet":"Spielerbilanz1","index":9,"n_rows":31,"n_cols":20,"rows_kept":31,"cut":false,"hidden":false,"merged":[[1,0,1,14],[1,19,2,19]]}
[]
["WEDEKIN, Franz",null,null,null,null,null,null,null,null,null,null,null,null,null,null,null,null,null,null,"Namen links in die Zelle eingeben und den Button Daten holen drücken."]
[]
[null,null,null,null,null,"GESAMT",null,null,{"$f":"(J4+L4)/2","v":24},{"$f":"SUBTOTAL(9,Q8:Q31)*2+SUBTOTAL(9,R8:R31)","v":39},":",{"$f":"SUBTOTAL(9,S8:S31)*2+SUBTOTAL(9,R8:R31)","v":9},{"$f":"SUBTOTAL(9,M8:M31)","v":176},":",{"$f":"SUBTOTAL(9,O8:O31)","v":89}]
[]
["Platz","lf.-Nr.","Datum","gespielt für",null,"gegen",null,"Saison",null,"Gegner","l","l","+","Tore","-","l","G","U","V"]
[]
[null,9,"1973-04-15","TFG 38 Hildesheim I","-","Würzburger TKF I",null,1973,null,"KLAUS, Robert",null,null,14,":",4,null,{"$f":"IF(M8>O8,1,0)","v":1},{"$f":"IF(ISNUMBER(O8),IF(M8=O8,1,0),)","v":0},{"$f":"IF(M8<O8,1,0)","v":0}]
[null,20,"1973-06-17","TFG 38 Hildesheim I","-","Berliner TV 62 I",null,1973,null,"KWELLA, Frank",null,null,14,":",7,null,{"$f":"IF(M9>O9,1,0)","v":1},{"$f":"IF(ISNUMBER(O9),IF(M9=O9,1,0),)","v":0},{"$f":"IF(M9<O9,1,0)","v":0}]
[null,7,"1973-04-14","TFG 38 Hildesheim I","-","TKV 59 Heslach Stuttgart I",null,1973,null,"PFETSCH, Jochem",null,null,11,":",2,null,1,0,0]
[null,20,"1973-06-17","TFG 38 Hildesheim I","-","Berliner TV 62 I",null,1973,null,"KLEINSCHMIDT, Gerd",null,null,11,":",2,null,1,0,0]
[null,21,"1973-08-19","TFG 38 Hildesheim I","-","TFC Kickers Hamburg I",null,1973,null,"KNORR, Peter",null,null,10,":",6,null,1,0,0]
[null,7,"1973-04-14","TFG 38 Hildesheim I","-","TKV 59 Heslach Stuttgart I",null,1973,null,"SCHMIßRAUTER, Manfred",null,null,9,":",3,null,1,0,0]
[null,21,"1973-08-19","TFG 38 Hildesheim I","-","TFC Kickers Hamburg I",null,1973,null,"NISSEN, Thomas",null,null,9,":",6,null,1,0,0]
[null,21,"1973-08-19","TFG 38 Hildesheim I","-","TFC Kickers Hamburg I",null,1973,null,"MAHNKE, Günter",null,null,8,":",1,null,1,0,0]
[null,7,"1973-04-14","TFG 38 Hildesheim I","-","TKV 59 Heslach Stuttgart I",null,1973,null,"WÖHR, Hans-Joachim",null,null,8,":",2,null,1,0,0]
[null,9,"1973-04-15","TFG 38 Hildesheim I","-","Würzburger TKF I",null,1973,null,"REUL, Winfried",null,null,8,":",2,null,1,0,0]
[null,19,"1973-06-16","TFG 38 Hildesheim I","-","TSC Berlin 67 I",null,1973,null,"SCHÖNFELD, Horst",null,null,8,":",2,null,1,0,0]
[null,20,"1973-06-17","TFG 38 Hildesheim I","-","Berliner TV 62 I",null,1973,null,"LEOPOLD, Wolfgang",null,null,8,":",4,null,1,0,0]
[null,20,"1973-06-17","TFG 38 Hildesheim I","-","Berliner TV 62 I",null,1973,null,"MIETKE, Wilfried",null,null,7,":",2,null,1,0,0]
[null,7,"1973-04-14","TFG 38 Hildesheim I","-","TKV 59 Heslach Stuttgart I",null,1973,null,"BECHT, Peter",null,null,7,":",5,null,1,0,0]
[null,17,"1973-06-10","TFG 38 Hildesheim I","-","SpVgg. Halbau Berlin I",null,1973,null,"DIEKERT, Wolfram",null,null,7,":",7,null,0,1,0]
[null,17,"1973-06-10","TFG 38 Hildesheim I","-","SpVgg. Halbau Berlin I",null,1973,null,"KOLSKI, Wolfgang",null,null,6,":",4,null,1,0,0]
[null,19,"1973-06-16","TFG 38 Hildesheim I","-","TSC Berlin 67 I",null,1973,null,"GRÜNEBERG, Klaus-Dieter",null,null,6,":",6,null,0,1,0]
[null,9,"1973-04-15","TFG 38 Hildesheim I","-","Würzburger TKF I",null,1973,null,"NÖRLING, Karl",null,null,5,":",3,null,1,0,0]
[null,9,"1973-04-15","TFG 38 Hildesheim I","-","Würzburger TKF I",null,1973,null,"BEMERL, Bernd",null,null,4,":",1,null,1,0,0]
[null,17,"1973-06-10","TFG 38 Hildesheim I","-","SpVgg. Halbau Berlin I",null,1973,null,"RÖPKE, Jürgen",null,null,4,":",3,null,1,0,0]
[null,21,"1973-08-19","TFG 38 Hildesheim I","-","TFC Kickers Hamburg I",null,1973,null,"CONRING, Olaf",null,null,4,":",5,null,0,0,1]
[null,19,"1973-06-16","TFG 38 Hildesheim I","-","TSC Berlin 67 I",null,1973,null,"GUTTMANN, Peter",null,null,4,":",7,null,0,0,1]
[null,19,"1973-06-16","TFG 38 Hildesheim I","-","TSC Berlin 67 I",null,1973,null,"GRÜNEBERG, Manfred",null,null,3,":",3,null,0,1,0]
[null,17,"1973-06-10","TFG 38 Hildesheim I","-","SpVgg. Halbau Berlin I",null,1973,null,"SUCHAN, Rainer",null,null,1,":",2,null,0,0,1]

{"sheet":"Spielerbilanz2","index":10,"n_rows":33,"n_cols":31,"rows_kept":33,"cut":false,"hidden":false,"merged":[[1,12,1,28],[1,30,2,30],[5,20,5,22],[5,24,5,26]]}
[]
[null,null,null,null,null,null,null,null,null,null,null,null,"WEDEKIN, Franz",null,null,null,null,null,null,null,null,null,null,null,null,null,null,null,null,null,"Namen in Spielerbilanz1 eingeben und die Daten werden geholt."]
[]
[null,null,null,null,null,null,null,null,null,null,null,null,null,"Gesamt",{"$f":"SUM(O8:O36)","v":24},null,{"$f":"SUM(Q8:Q36)","v":18},{"$f":"SUM(R8:R36)","v":3},{"$f":"SUM(S8:S36)","v":3},null,{"$f":"SUM(U8:U36)","v":39},":",{"$f":"SUM(W8:W36)","v":9},null,{"$f":"SUM(Y8:Y36)","v":176},":",{"$f":"SUM(AA8:AA36)","v":89},{"$f":"SUM(AB8:AB36)","v":87}]
[]
["Anzahl von Gegner",null,null,null,null,null,null,null,null,null,null,null,null,"Gegner","Spiele",null,"S","U","V",null,"Punkte",null,null,null,"Tore",null,null,"Diff."]
["Gegner","Ergebnis"]
["DIEKERT, Wolfram",1,null,null,null,null,null,null,null,null,null,null,null,"KLAUS, Robert",1,null,1,0,0,null,2,":",0,null,14,":",4,10]
["GRÜNEBERG, Klaus-Dieter",1,null,null,null,null,null,null,null,null,null,null,null,"KLEINSCHMIDT, Gerd",1,null,1,0,0,null,2,":",0,null,11,":",2,9]
["GRÜNEBERG, Manfred",1,null,null,null,null,null,null,null,null,null,null,null,"PFETSCH, Jochem",1,null,1,0,0,null,2,":",0,null,11,":",2,9]
["GUTTMANN, Peter",1,null,null,null,null,null,null,null,null,null,null,null,"KWELLA, Frank",1,null,1,0,0,null,2,":",0,null,14,":",7,7]
["KLEINSCHMIDT, Gerd",1,null,null,null,null,null,null,null,null,null,null,null,"MAHNKE, Günter",1,null,1,0,0,null,2,":",0,null,8,":",1,7]
["KOLSKI, Wolfgang",1,null,null,null,null,null,null,null,null,null,null,null,"SCHMIßRAUTER, Manfred",1,null,1,0,0,null,2,":",0,null,9,":",3,6]
["LEOPOLD, Wolfgang",1,null,null,null,null,null,null,null,null,null,null,null,"SCHÖNFELD, Horst",1,null,1,0,0,null,2,":",0,null,8,":",2,6]
["MIETKE, Wilfried",1,null,null,null,null,null,null,null,null,null,null,null,"WÖHR, Hans-Joachim",1,null,1,0,0,null,2,":",0,null,8,":",2,6]
["SCHÖNFELD, Horst",1,null,null,null,null,null,null,null,null,null,null,null,"REUL, Winfried",1,null,1,0,0,null,2,":",0,null,8,":",2,6]
["(Leer)",null,null,null,null,null,null,null,null,null,null,null,null,"MIETKE, Wilfried",1,null,1,0,0,null,2,":",0,null,7,":",2,5]
["KLAUS, Robert",1,null,null,null,null,null,null,null,null,null,null,null,"KNORR, Peter",1,null,1,0,0,null,2,":",0,null,10,":",6,4]
["KWELLA, Frank",1,null,null,null,null,null,null,null,null,null,null,null,"LEOPOLD, Wolfgang",1,null,1,0,0,null,2,":",0,null,8,":",4,4]
["PFETSCH, Jochem",1,null,null,null,null,null,null,null,null,null,null,null,"NISSEN, Thomas",1,null,1,0,0,null,2,":",0,null,9,":",6,3]
["KNORR, Peter",1,null,null,null,null,null,null,null,null,null,null,null,"BEMERL, Bernd",1,null,1,0,0,null,2,":",0,null,4,":",1,3]
["SCHMIßRAUTER, Manfred",1,null,null,null,null,null,null,null,null,null,null,null,"BECHT, Peter",1,null,1,0,0,null,2,":",0,null,7,":",5,2]
["NISSEN, Thomas",1,null,null,null,null,null,null,null,null,null,null,null,"KOLSKI, Wolfgang",1,null,1,0,0,null,2,":",0,null,6,":",4,2]
["MAHNKE, Günter",1,null,null,null,null,null,null,null,null,null,null,null,"NÖRLING, Karl",1,null,1,0,0,null,2,":",0,null,5,":",3,2]
["WÖHR, Hans-Joachim",1,null,null,null,null,null,null,null,null,null,null,null,"RÖPKE, Jürgen",1,null,1,0,0,null,2,":",0,null,4,":",3,1]
["REUL, Winfried",1,null,null,null,null,null,null,null,null,null,null,null,"DIEKERT, Wolfram",1,null,0,1,0,null,1,":",1,null,7,":",7,0]
["BECHT, Peter",1,null,null,null,null,null,null,null,null,null,null,null,"GRÜNEBERG, Klaus-Dieter",1,null,0,1,0,null,1,":",1,null,6,":",6,0]
["NÖRLING, Karl",1,null,null,null,null,null,null,null,null,null,null,null,"GRÜNEBERG, Manfred",1,null,0,1,0,null,1,":",1,null,3,":",3,0]
["BEMERL, Bernd",1,null,null,null,null,null,null,null,null,null,null,null,"CONRING, Olaf",1,null,0,0,1,null,0,":",2,null,4,":",5,-1]
["RÖPKE, Jürgen",1,null,null,null,null,null,null,null,null,null,null,null,"SUCHAN, Rainer",1,null,0,0,1,null,0,":",2,null,1,":",2,-1]
["CONRING, Olaf",1,null,null,null,null,null,null,null,null,null,null,null,"GUTTMANN, Peter",1,null,0,0,1,null,0,":",2,null,4,":",7,-3]
["SUCHAN, Rainer",1]
["Gesamtergebnis",24]

{"sheet":"Tabelle1","index":11,"n_rows":0,"n_cols":0,"rows_kept":0,"cut":false,"hidden":true,"merged":[]}